{"text_format":"1","workbook":"xlsx","n_sheets":3,"sheets":["CONTRATACION MARZO ","PIC  MARZO 2020","CONTRATOS COVIC 19"],"not_rendered":{"charts":0,"images":0,"macros":1,"external_links":1,"defined_names":1,"comments":2,"pivot_tables":0},"unopened":[],"bounds":{"document_bytes":16777216,"sheet_cells":100000,"rows_first":2000,"rows_last":500,"rows_between":2000,"halvings":0,"cell_chars":16384,"cell_head_chars":4096},"cells_cut":0,"cells_raw":0,"read":"whole","date_system":"1900"}

{"sheet":"CONTRATACION MARZO ","index":0,"n_rows":431,"n_cols":16,"rows_kept":431,"cut":false,"hidden":false,"merged":[]}
[" ","CEDULA","NOMBRES APELLIDOS CONTRATISTA","# OPS","# OPS  CON AÑO ","OBJETO DEL CONTRATO","FECHA INICIO","FECHA TERMINACION ","VALOR MENSUAL","VALOR TOTAL ","SUPERVISOR ","CARGO","CDP","RP","FECHA SECOP "]
[1,7455342,"ADOLFO MARIO DE LA HOZ BERNAL","0882","0882-2020","MEDICO DE URGENCIA"," 02 de marzo de 2020  ","  31 de marzo de 2020",2560000,{"$f":"I2*1","v":2560000},"WILFRAN JIMENEZ DE LA PEÑA","COORD CENTRO DE SALUD",1109,1990,"2020-03-16",{"$f":"VLOOKUP(B2:B431,'[1]CONTRATACION MARZO '!$B$2:$AB$431,27,0)","v":"https://www.contratos.gov.co/consultas/detalleProceso.do?numConstancia=20-4-10584788"}]
[{"$f":"+A2+1","v":2},55309225,"ADRIANA BALLESTAS MARTINEZ","0883","0883-2020","MEDICO DE URGENCIA"," 02 de marzo de 2020  "," 31 de marzo de 2020",2560000,2560000,"SERGIO BOVEA MARIN","COORD CENTRO DE SALUD",1110,1991,"2020-03-16",{"$f":"VLOOKUP(B3:B431,'[1]CONTRATACION MARZO '!$B$2:$AB$431,27,0)","v":"https://www.contratos.gov.co/consultas/detalleProceso.do?numConstancia=20-4-10584800"}]
[3,1103109488,"ADRIANA MARCELA CASTAÑO RODELO","0884","0884-2020","MEDICO CARDIOVASCULAR"," 02 de marzo de 2020  "," 31 de marzo de 2020",2300000,2300000,"DIANA MARTINEZ PACHECO","COORD CENTRO DE SALUD",1111,1992,"2020-03-16",{"$f":"VLOOKUP(B4:B431,'[1]CONTRATACION MARZO '!$B$2:$AB$431,27,0)","v":"https://www.contratos.gov.co/consultas/detalleProceso.do?numConstancia=20-4-10584818"}]
[4,22465848,"ADRIANA OROZCO CANTILLO","0885","0885-2020","AUXILIAR SERVICIOS GENERALES"," 02 de marzo de 2020  "," 31 de marzo de 2020",1215000,1215000,"LUIS CARLOS DE LEON BERNIER","COORD CENTRO DE SALUD",1112,1993,"2020-03-16",{"$f":"VLOOKUP(B5:B431,'[1]CONTRATACION MARZO '!$B$2:$AB$431,27,0)","v":"https://www.contratos.gov.co/consultas/detalleProceso.do?numConstancia=20-4-10584827"}]
[5,1140895535,"ADRIANA PAOLA GONZALEZ ROMERO ","0886","0886-2020","ENFERMERA JEFE"," 02 de marzo de 2020  "," 31 de marzo de 2020",2120000,2120000,"AIX PALACIO","COORD CENTRO DE SALUD",1113,1994,"2020-03-16",{"$f":"VLOOKUP(B6:B431,'[1]CONTRATACION MARZO '!$B$2:$AB$431,27,0)","v":"https://www.contratos.gov.co/consultas/detalleProceso.do?numConstancia=20-4-10584832"}]
[6,36555688,"ALBA SOLANO COCA","0887","0887-2020","ODONTOLOGO"," 02 de marzo de 2020  "," 31 de marzo de 2020",1900000,1900000,"CARLOS VISBAL JIMENEZ","COORD CENTRO DE SALUD",1114,1995,"2020-03-16",{"$f":"VLOOKUP(B7:B431,'[1]CONTRATACION MARZO '!$B$2:$AB$431,27,0)","v":"https://www.contratos.gov.co/consultas/detalleProceso.do?numConstancia=20-4-10584838"}]
[7,1140874429,"ALBERTO DE LA OSSA DE AVILA","0888","0888-2020","PROFESIONAL DE PRESUPUESTO "," 02 de marzo de 2020  "," 31 de marzo de 2020",3000000,3000000,"ALFONSO NICOLAS OQUENDO","DIRECTOR FINANCIERO",1115,1996,"2020-03-16",{"$f":"VLOOKUP(B8:B431,'[1]CONTRATACION MARZO '!$B$2:$AB$431,27,0)","v":"https://www.contratos.gov.co/consultas/detalleProceso.do?numConstancia=20-4-10584874"}]
[8,8505956,"ALBERTO NAVARRO MORALES","0889","0889-2020","AUXILIAR DE FACTURACION URGENCIA"," 02 de marzo de 2020  "," 31 de marzo de 2020",1400000,1400000,"SANDRA SANMARTIN","SUBGERENCIA ADMINISTRATIVA",1116,1997,"2020-03-16",{"$f":"VLOOKUP(B9:B431,'[1]CONTRATACION MARZO '!$B$2:$AB$431,27,0)","v":"https://www.contratos.gov.co/consultas/detalleProceso.do?numConstancia=20-4-10584882"}]
[9,37577926,"ALCIRA CAMPO ALCOZER","0890","0890-2020","AUXILIAR SERVICIOS GENERALES"," 02 de marzo de 2020  "," 31 de marzo de 2020",1215000,1215000,"SANDRA SANMARTIN","SUBGERENCIA ADMINISTRATIVA",1117,1998,"2020-03-16",{"$f":"VLOOKUP(B10:B431,'[1]CONTRATACION MARZO '!$B$2:$AB$431,27,0)","v":"https://www.contratos.gov.co/consultas/detalleProceso.do?numConstancia=20-4-10584914"}]
[10,64543985,"ALCIRA GOMEZ ARRIETA ","0891","0891-2020","ENFERMERA JEFE COORDINADORA PAI "," 02 de marzo de 2020  "," 31 de marzo de 2020",4000000,4000000,"NILSA ARIZA MARQUEZ","COORDINADOR PYP",1118,1999,"2020-03-16",{"$f":"VLOOKUP(B11:B431,'[1]CONTRATACION MARZO '!$B$2:$AB$431,27,0)","v":"https://www.contratos.gov.co/consultas/detalleProceso.do?numConstancia=20-4-10584922"}]
[11,1042428171,"ALEX ENRIQUE VILLARREAL IBAÑEZ","0892","0892-2020","ODONTOLOGO"," 02 de marzo de 2020  "," 31 de marzo de 2020",1900000,1900000,"SERGIO BOVEA MARIN","COORD CENTRO DE SALUD",1119,2000,"2020-03-16",{"$f":"VLOOKUP(B12:B431,'[1]CONTRATACION MARZO '!$B$2:$AB$431,27,0)","v":"https://www.contratos.gov.co/consultas/detalleProceso.do?numConstancia=20-4-10584940"}]
[12,8777621,"ALEXANDER MIGUEL SALAZAR CABALLERO","0893","0893-2020","AUXILIAR DE FACTURACION URGENCIA"," 02 de marzo de 2020  "," 31 de marzo de 2020",1400000,1400000,"SANDRA SANMARTIN","SUBGERENCIA ADMINISTRATIVA",1120,2001,"2020-03-16",{"$f":"VLOOKUP(B13:B431,'[1]CONTRATACION MARZO '!$B$2:$AB$431,27,0)","v":"https://www.contratos.gov.co/consultas/detalleProceso.do?numConstancia=20-4-10584951"}]
[13,22523223,"ALEXANDRA ESTHER MOLINA PEREZ","0894","0894-2020","AUXILIAR SERVICIOS GENERALES URGENCIA"," 02 de marzo de 2020  "," 31 de marzo de 2020",1378000,1378000,"SERGIO BOVEA MARIN","COORD CENTRO DE SALUD",1121,2002,"2020-03-16",{"$f":"VLOOKUP(B14:B431,'[1]CONTRATACION MARZO '!$B$2:$AB$431,27,0)","v":"https://www.contratos.gov.co/consultas/detalleProceso.do?numConstancia=20-4-10584968"}]
[14,1140881787,"ALEXANDRA GUZMAN QUINTERO","0895","0895-2020","ASISTENTE OFICINA JURIDICA "," 02 de marzo de 2020  "," 31 de marzo de 2020",3000000,3000000,"ORNELLA FIORENTINO ","JEFE DE JURIDICA",1122,2003,"2020-03-16",{"$f":"VLOOKUP(B15:B431,'[1]CONTRATACION MARZO '!$B$2:$AB$431,27,0)","v":"https://www.contratos.gov.co/consultas/detalleProceso.do?numConstancia=20-4-10584979"}]
[15,8714709,"ALFONSO DOMINGUEZ MARENCO","0896","0896-2020","AUXILIAR DE ARCHIVO "," 02 de marzo de 2020  "," 31 de marzo de 2020",1500000,1500000,"SANDRA SANMARTIN","SUBGERENCIA ADMINISTRATIVA",1123,2004,"2020-03-16",{"$f":"VLOOKUP(B16:B431,'[1]CONTRATACION MARZO '!$B$2:$AB$431,27,0)","v":"https://www.contratos.gov.co/consultas/detalleProceso.do?numConstancia=20-4-10585013"}]
[16,72000601,"ALEXIS JAVIER SUAREZ CABALLERO","0897","0897-2020","AUXILIAR DE FACTURACION URGENCIA"," 02 de marzo de 2020  "," 31 de marzo de 2020",1400000,1400000,"SANDRA SANMARTIN","SUBGERENCIA ADMINISTRATIVA",1124,2005,"2020-03-16",{"$f":"VLOOKUP(B17:B431,'[1]CONTRATACION MARZO '!$B$2:$AB$431,27,0)","v":"https://www.contratos.gov.co/consultas/detalleProceso.do?numConstancia=20-4-10585038"}]
[17,1045716759,"ALFREDO ANGULO JULIAO","0898","0898-2020","AUXILIAR DE FACTURACION URGENCIA"," 02 de marzo de 2020  "," 31 de marzo de 2020",1400000,1400000,"SANDRA SANMARTIN","SUBGERENCIA ADMINISTRATIVA",1125,2006,"2020-03-16",{"$f":"VLOOKUP(B18:B431,'[1]CONTRATACION MARZO '!$B$2:$AB$431,27,0)","v":"https://www.contratos.gov.co/consultas/detalleProceso.do?numConstancia=20-4-10585051"}]
[18,15666678,"ALFREDO ANTONIO RAMIREZ PEREIRA","0899","0899-2020","COORDINADOR DE ARCHIVO "," 02 de marzo de 2020  "," 31 de marzo de 2020",3000000,3000000,"SANDRA SANMARTIN","SUBGERENCIA ADMINISTRATIVA",1126,2007,"2020-03-16",{"$f":"VLOOKUP(B19:B431,'[1]CONTRATACION MARZO '!$B$2:$AB$431,27,0)","v":"https://www.contratos.gov.co/consultas/detalleProceso.do?numConstancia=20-4-10585061"}]
[19,8721508,"ALONSO JOSÉ RIQUETT DE LA HOZ","0900","0900-2020","MEDICO P Y P "," 02 de marzo de 2020  "," 31 de marzo de 2020",2120000,2120000,"CARLOS VISBAL JIMENEZ","COORD CENTRO DE SALUD",1127,2008,"2020-03-16",{"$f":"VLOOKUP(B20:B431,'[1]CONTRATACION MARZO '!$B$2:$AB$431,27,0)","v":"https://www.contratos.gov.co/consultas/detalleProceso.do?numConstancia=20-4-10585135"}]
[20,1139614174,"ALONSO MATEO LLANES ARIZA","0901","0901-2020","MEDICO CONSULTA EXTERNA "," 02 de marzo de 2020  "," 31 de marzo de 2020",2120000,2120000,"AIX PALACIO","COORD CENTRO DE SALUD",1128,2009,"2020-03-16",{"$f":"VLOOKUP(B21:B431,'[1]CONTRATACION MARZO '!$B$2:$AB$431,27,0)","v":"https://www.contratos.gov.co/consultas/detalleProceso.do?numConstancia=20-4-10585208"}]
[21,8697543,"ALVARO ARENAS GONZALEZ","0902","0902-2020","MEDICO DE MATERNIDAD "," 02 de marzo de 2020  "," 31 de marzo de 2020",4240000,4240000,"SERGIO BOVEA MARIN","COORD CENTRO DE SALUD",1129,2010,"2020-03-16",{"$f":"VLOOKUP(B22:B431,'[1]CONTRATACION MARZO '!$B$2:$AB$431,27,0)","v":"https://www.contratos.gov.co/consultas/detalleProceso.do?numConstancia=20-4-10585234"}]
[22,7407679,"AMEFI PACHECO CERA","0903","0903-2020","ORIENTADOR"," 02 de marzo de 2020  "," 31 de marzo de 2020",1270000,1270000,"AIX PALACIO","COORD CENTRO DE SALUD",1130,2011,"2020-03-16",{"$f":"VLOOKUP(B23:B431,'[1]CONTRATACION MARZO '!$B$2:$AB$431,27,0)","v":"https://www.contratos.gov.co/consultas/detalleProceso.do?numConstancia=20-4-10585289"}]
[23,1047338042,"AMINTA PARDO GUZMAN","0904","0904-2020","AUXILIAR DE ENFERMERIA CONSULTA EXTERNA "," 02 de marzo de 2020  "," 31 de marzo de 2020",1749000,1749000,"DIANA MARTINEZ PACHECO","COORD CENTRO DE SALUD",1131,2012,"2020-03-16",{"$f":"VLOOKUP(B24:B431,'[1]CONTRATACION MARZO '!$B$2:$AB$431,27,0)","v":"https://www.contratos.gov.co/consultas/detalleProceso.do?numConstancia=20-4-10585326"}]
[24,1045688469,"AMY MOVILLA COMAS","0905","0905-2020","ENFERMERA JEFE CONSULTA EXTERNA "," 02 de marzo de 2020  "," 31 de marzo de 2020",2300000,2300000,"DIANA MARTINEZ PACHECO","COORD CENTRO DE SALUD",1132,2013,"2020-03-16",{"$f":"VLOOKUP(B25:B431,'[1]CONTRATACION MARZO '!$B$2:$AB$431,27,0)","v":"https://www.contratos.gov.co/consultas/detalleProceso.do?numConstancia=20-4-10585343"}]
[25,32813366,"ANA GONZALEZ ZAMBRANO","0906","0906-2020","AUXILIAR DE ARCHIVO "," 02 de marzo de 2020  "," 31 de marzo de 2020",1500000,1500000,"SANDRA SANMARTIN","SUBGERENCIA ADMINISTRATIVA",1133,2014,"2020-03-16",{"$f":"VLOOKUP(B26:B431,'[1]CONTRATACION MARZO '!$B$2:$AB$431,27,0)","v":"https://www.contratos.gov.co/consultas/detalleProceso.do?numConstancia=20-4-10585391"}]
[26,1045704276,"ANA MILENA HERRERA ALVIS ","0907","0907-2020","ENFERMERA JEFE "," 02 de marzo de 2020  "," 31 de marzo de 2020",2300000,2300000,"NILSA ARIZA MARQUEZ","COORDINADOR PYP",1134,2015,"2020-03-16",{"$f":"VLOOKUP(B27:B431,'[1]CONTRATACION MARZO '!$B$2:$AB$431,27,0)","v":"https://www.contratos.gov.co/consultas/detalleProceso.do?numConstancia=20-4-10585429"}]
[27,22739459,"ANA MILENA L´HOESTE ROA","0908","0908-2020","COORDINADORA CONSULTA EXTERNA"," 02 de marzo de 2020  "," 31 de marzo de 2020",3700000,3700000,"BETTY PERTUZ ","SUBGERENCIA CIENTIFICA",1135,2016,"2020-03-16",{"$f":"VLOOKUP(B28:B431,'[1]CONTRATACION MARZO '!$B$2:$AB$431,27,0)","v":"https://www.contratos.gov.co/consultas/detalleProceso.do?numConstancia=20-4-10585444"}]
[28,32825462,"ANAIS DE JESUS RODRIGUEZ DE  LAS AGUAS","0909","0909-2020","AUXILIAR SERVICIOS GENERALES"," 02 de marzo de 2020  "," 31 de marzo de 2020",1215000,1215000,"SANDRA SANMARTIN","ADMON COSTA HERMOSA",1136,2017,"2020-03-16",{"$f":"VLOOKUP(B29:B431,'[1]CONTRATACION MARZO '!$B$2:$AB$431,27,0)","v":"https://www.contratos.gov.co/consultas/detalleProceso.do?numConstancia=20-4-10585472"}]
[29,1045706259,"ANDREA CAROLINA HERRERA ORTEGA","0910","0910-2020","MEDICO CONSULTA EXTERNA"," 02 de marzo de 2020  "," 31 de marzo de 2020",2120000,2120000,"LUIS GRANADOS GOMEZ","COORD CENTRO DE SALUD",1137,2018,"2020-03-16",{"$f":"VLOOKUP(B30:B431,'[1]CONTRATACION MARZO '!$B$2:$AB$431,27,0)","v":"https://www.contratos.gov.co/consultas/detalleProceso.do?numConstancia=20-4-10585512"}]
[30,1001821798,"ANGELA JUDITH BARRIOS MEJIA","0911","0911-2020","AUXILIAR DE ENFERMERIA URGENCIAS"," 02 de marzo de 2020  "," 31 de marzo de 2020",1378000,1378000,"WILFRAN JIMENEZ DE LA PEÑA","COORD CENTRO DE SALUD",1138,2019,"2020-03-16",{"$f":"VLOOKUP(B31:B431,'[1]CONTRATACION MARZO '!$B$2:$AB$431,27,0)","v":"https://www.contratos.gov.co/consultas/detalleProceso.do?numConstancia=20-4-10585543"}]
[31,22641629,"ANGELICA CARCAMO ANAYA","0912","0912-2020","AGENTE CALL CENTER"," 02 de marzo de 2020  "," 31 de marzo de 2020",1378000,1378000,"WILFRAN JIMENEZ DE LA PEÑA","COORD CENTRO DE SALUD",1139,2020,"2020-03-16",{"$f":"VLOOKUP(B32:B431,'[1]CONTRATACION MARZO '!$B$2:$AB$431,27,0)","v":"https://www.contratos.gov.co/consultas/detalleProceso.do?numConstancia=20-4-10585555"}]
[32,22736159,"ARACELLY HERNANDEZ GARCIA ","0913","0913-2020","DIGITADOR PAI WEB "," 02 de marzo de 2020  "," 31 de marzo de 2020",2500000,2500000,"NILSA ARIZA MARQUEZ","COORDINADOR PYP",1140,2021,"2020-03-16",{"$f":"VLOOKUP(B33:B431,'[1]CONTRATACION MARZO '!$B$2:$AB$431,27,0)","v":"https://www.contratos.gov.co/consultas/detalleProceso.do?numConstancia=20-4-10585600"}]
[33,32869290,"ARGENEDITH YEPEZ ESCALANTE ","0914","0914-2020","MEDICO P Y P"," 02 de marzo de 2020  "," 31 de marzo de 2020",2120000,2120000,"LUIS GRANADOS GOMEZ","COORD CENTRO DE SALUD",1141,2022,"2020-03-16",{"$f":"VLOOKUP(B34:B431,'[1]CONTRATACION MARZO '!$B$2:$AB$431,27,0)","v":"https://www.contratos.gov.co/consultas/detalleProceso.do?numConstancia=20-4-10585624"}]
[{"$f":"+A34+1","v":34},1140850083,"ARLINY YANNINY RAMIREZ FIGUEROA","0915","0915-2020","ASESOR DE PRESUPUESTO"," 02 de marzo de 2020  "," 31 de marzo de 2020",4000000,4000000,"ALFONSO NICOLAS OQUENDO","DIRECTOR FINANCIERO",1142,2023,"2020-03-16",{"$f":"VLOOKUP(B35:B431,'[1]CONTRATACION MARZO '!$B$2:$AB$431,27,0)","v":"https://www.contratos.gov.co/consultas/detalleProceso.do?numConstancia=20-4-10585641"}]
[35,1042444527,"ARNOLD RINCON MARTINEZ","0916","0916-2020","PROFESIONAL PLANEACION ESTRATEGICA"," 02 de marzo de 2020  "," 31 de marzo de 2020",4000000,4000000,"SANDRA SANMARTIN","SUBGERENCIA ADMINISTRATIVA",1143,2024,"2020-03-16",{"$f":"VLOOKUP(B36:B431,'[1]CONTRATACION MARZO '!$B$2:$AB$431,27,0)","v":"https://www.contratos.gov.co/consultas/detalleProceso.do?numConstancia=20-4-10585665"}]
[36,32767778,"BEATRIZ ELENA GUTIERREZ AHUMADA","0917","0917-2020","DIGITADOR PAI WEB "," 02 de marzo de 2020  "," 31 de marzo de 2020",1378000,1378000,"NILSA ARIZA MARQUEZ","COORDINADOR PYP",1144,2025,"2020-03-16",{"$f":"VLOOKUP(B37:B431,'[1]CONTRATACION MARZO '!$B$2:$AB$431,27,0)","v":"https://www.contratos.gov.co/consultas/detalleProceso.do?numConstancia=20-4-10585682"}]
[37,45496113,"BEATRIZ HELENA JIMENO CARDENAS","0918","0918-2020","AUXILIAR DE ARCHIVO "," 02 de marzo de 2020  "," 31 de marzo de 2020",1500000,1500000,"SANDRA SANMARTIN","SUBGERENCIA ADMINISTRATIVA",1145,2026,"2020-03-16",{"$f":"VLOOKUP(B38:B431,'[1]CONTRATACION MARZO '!$B$2:$AB$431,27,0)","v":"https://www.contratos.gov.co/consultas/detalleProceso.do?numConstancia=20-4-10585705"}]
[38,32780077,"BELKIS  BOSSIO ESCORCIA","0919","0919-2020","MEDICO DE URGENCIA"," 02 de marzo de 2020  "," 31 de marzo de 2020",2560000,2560000,"WILFRAN JIMENEZ DE LA PEÑA","COORD CENTRO DE SALUD",1146,2027,"2020-03-16",{"$f":"VLOOKUP(B39:B431,'[1]CONTRATACION MARZO '!$B$2:$AB$431,27,0)","v":"https://www.contratos.gov.co/consultas/detalleProceso.do?numConstancia=20-4-10585721"}]
[39,32736237,"BETTY ROMERO RODRIGUEZ ","0920","0920-2020","AUXILIAR SERVICIOS GENERALES URGENCIA"," 02 de marzo de 2020  "," 31 de marzo de 2020",1378000,1378000,"WILFRAN JIMENEZ DE LA PEÑA","COORD CENTRO DE SALUD",1147,2028,"2020-03-16",{"$f":"VLOOKUP(B40:B431,'[1]CONTRATACION MARZO '!$B$2:$AB$431,27,0)","v":"https://www.contratos.gov.co/consultas/detalleProceso.do?numConstancia=20-4-10585742"}]
{"$rows_left_out":392}
{"sheet":"PIC  MARZO 2020","index":1,"n_rows":3,"n_cols":36,"rows_kept":3,"cut":false,"hidden":false,"merged":[]}
[null,"CEDULA","NOMBRE Y APELLIDO","# OPS","#OPS","FECHA INICIO","FECHA TERMINACION ","OBJETO DEL CONTRATO","VALOR MENSUAL","VALOR TOTAL ","VALOR LETRAS total","SUPERVISOR ","CARGO","RUBRO PRESUPUESTAL ","CDP","RP","POLIZA/RESPONSABILIDAD CIVIL PROFESIONAL ","CENTRO DE SALUD","RUBRO","ACREDITACION ","servicio","perfil","CONDICIONES DEL CONTRATO ","forma de pago","VALOR LETRAS MES","VIGENCIA ","CONDICIONES","AREA ","FECHA SECOP LINK SECOP ","LINK SECOOP","FUNCIONES ESPECIFICAS","GARANTIAS ","FORMATO DE PAGO 1 ","PAGO FINAL ","FECHA SECOP ","LINK SECOP "]
[1,44152281,"KAREN JOHANA JIMENEZ RAMOS","068","0068-2020-PIC","02 marzo de 2020","31 MARZO DE 2020","APOYO A LA GESTION DIMENSIÓN_DE_SALUD_AMBIENTAL: Zoonosis",1900000,1900000,{"$f":"PesosMN(J2)","v":"  UN MILLON NOVECIENTOS MIL PESOS "},"NILSA ARIZA MARQUEZ","COORDINADOR P Y P","PIC",1538,2422,null,null,null,null,null,null,null,null,null,null,null,null,null,null,null,null,null,null,"2020-03-28","https://www.contratos.gov.co/consultas/detalleProceso.do?numConstancia=20-4-10630084"]
[2,22617307,"ETILVIA TERESA DONADO CABALLERO ","069","0069-2020-PIC","02 marzo de 2020","31 MARZO DE 2020","PSICOLOGO ",2500000,2500000,{"$f":"PesosMN(J3)","v":"  DOS MILLONES QUINIENTOS MIL PESOS "},"BETTY PERTUZ","SUBGERENTE CIENTIFICO","PIC",1539,2423,null,null,null,null,null,null,null,null,null,null,null,null,null,null,null,null,null,null,"2020-03-28","https://www.contratos.gov.co/consultas/detalleProceso.do?numConstancia=20-4-10630789"]

{"sheet":"CONTRATOS COVIC 19","index":2,"n_rows":7,"n_cols":16,"rows_kept":7,"cut":false,"hidden":false,"merged":[]}
[" ","CEDULA","NOMBRES APELLIDOS CONTRATISTA","# OPS","# OPS  CON AÑO ","OBJETO DEL CONTRATO","FECHA INICIO","FECHA TERMINACION ","VALOR MENSUAL","VALOR TOTAL ","SUPERVISOR ","CARGO","CDP","RP","FECHA SECOP LINK SECOP ","LINK SECOOP"]
[1,55302261,"VANESSA PAOLA DURANPEÑARANDA","1312","1312-2020-CV19","FISIOTERAPEUTA"," 02 de marzo de 2020  ","30 de abril 2020",2500000,{"$f":"I2*2","v":5000000},"CESAR ARRIETA","COORD CENTRO DE SALUD",1533,2414,"2020-03-29","https://www.contratos.gov.co/consultas/detalleProceso.do?numConstancia=20-4-10631361"]
[{"$f":"+A2+1","v":2},1193512615,"JORGE ELEICER DE LA CRUZ GONZALEZ","1313","1313-2020- CV19","FISIOTERAPEUTA"," 02 de marzo de 2020  ","30 de abril 2020",2500000,5000000,"CESAR ARRIETA","COORD CENTRO DE SALUD",1534,2415,"2020-03-29","https://www.contratos.gov.co/consultas/detalleProceso.do?numConstancia=20-4-10631373"]
[{"$f":"+A3+1","v":3},53107458,"JANNE  PADILLA ITURRIAGO","1314","1314-2020-CV19","AUXILIAR DE ENFERMERIA"," 02 de marzo de 2020  ","30 de abril 2020",1500000,3000000,"CESAR ARRIETA","COORD CENTRO DE SALUD",1535,2416,"2020-03-29","https://www.contratos.gov.co/consultas/detalleProceso.do?numConstancia=20-4-10631376"]
[4,1042457847,"EYLEEN LUCIA ZAMBRANO","1315","1315-2020-CV19","AUXILIAR DE ENFERMERIA"," 02 de marzo de 2020  ","30 de abril 2020",1500000,3000000,"CESAR ARRIETA","COORD CENTRO DE SALUD",1536,2417,"2020-03-29","https://www.contratos.gov.co/consultas/detalleProceso.do?numConstancia=20-4-10631380"]
[5,1045729651,"KAROLAY PAOLA GARCIA OSPINO","1316","1316-2020-CV19","MEDICO"," 02 de marzo de 2020  ","30 de abril 2020",4240000,8480000,"CESAR ARRIETA","COORD CENTRO DE SALUD",1553,2460,"2020-03-29","https://www.contratos.gov.co/consultas/detalleProceso.do?numConstancia=20-4-10631389"]
[6,72193875,"CRISTIAN DE JESUS BARRAZA VILLALBA","0939","0939-2020-CV19","CONDUCTOR DE AMBULANCIA"," 02 de marzo de 2020  ","30 de abril de 2020",3600000,7200000,"CESAR ARRIETA","COORD CENTRO DE SALUD",1166,2047,"2020-03-29","https://www.contratos.gov.co/consultas/detalleProceso.do?numConstancia=20-4-10587468"]