{"text_format":"1","workbook":"xlsx","n_sheets":3,"sheets":["ABRIL 2020","PIC ABRIL ","Hoja1"],"not_rendered":{"charts":0,"images":0,"macros":1,"external_links":3,"defined_names":2,"comments":2,"pivot_tables":0},"unopened":[],"bounds":{"document_bytes":16777216,"sheet_cells":100000,"rows_first":2000,"rows_last":500,"rows_between":2000,"halvings":0,"cell_chars":16384,"cell_head_chars":4096},"cells_cut":0,"cells_raw":0,"read":"whole","date_system":"1900"}

{"sheet":"ABRIL 2020","index":0,"n_rows":446,"n_cols":15,"rows_kept":446,"cut":false,"hidden":false,"merged":[[0,0,1,4]]}
["LISTADO DE CONTRATACION  MES DE ABRIL 2020"]
[]
["CEDULA","NOMBRES APELLIDOS CONTRATISTA","# OPS","#OPS CON AÑO","OBJETO DEL CONTRATO","FECHA INICIO","FECHA TERMINACION ","VALOR MENSUAL","VALOR TOTAL ","SUPERVISOR ","CARGO","CDP","RP","FECHA DE LINK","LINKSECOOP "]
[1140874429,"ALBERTO DE LA OSSA DE AVILA",1324,"1324-2020","PROFESIONAL DE PRESUPUESTO ","01 de Abril de 2020","  30 de Abril de  2020",3000000,{"$f":"+H4*1","v":3000000},"ALFONSO NICOLAS OQUENDO","DIRECTOR FINANCIERO",1600,2521,{"$f":"VLOOKUP(A4:A444,'[2]ABRIL 2020'!$B$3:$M$584,12,0)","v":"2020-04-20"},"https://www.contratos.gov.co/consultas/detalleProceso.do?numConstancia=20-4-10688521"]
[1048204901,"ALEXANDER RAFAEL OTERO PADILLA",{"$f":"+C4+1","v":1325},"1325-2020","AUXILIAR DE PRSUPUESTO","01 de Abril de 2020","  30 de Abril de  2020",4000000,4000000,"ALFONSO NICOLAS OQUENDO","DIRECTOR FINANCIERO",1601,2522,{"$f":"VLOOKUP(A5:A443,'[2]ABRIL 2020'!$B$3:$M$584,12,0)","v":"2020-04-20"},"https://www.contratos.gov.co/consultas/detalleProceso.do?numConstancia=20-4-10688532"]
[1140881787,"ALEXANDRA GUZMAN QUINTERO",1326,"1326-2020","ASISTENTE OFICINA JURIDICA ","01 de Abril de 2020","  30 de Abril de  2020",3000000,3000000,"ORNELLA FIORENTINO ","JEFE DE JURIDICA",1602,2523,{"$f":"VLOOKUP(A6:A444,'[2]ABRIL 2020'!$B$3:$M$584,12,0)","v":"2020-04-20"},"https://www.contratos.gov.co/consultas/detalleProceso.do?numConstancia=20-4-10688559"]
[22739459,"ANA MILENA L´HOESTE ROA",1327,"1327-2020","COORDINADORA CONSULTA EXTERNA","01 de Abril de 2020","  30 de Abril de  2020",3700000,3700000,"BETTY PERTUZ ","SUBGERENCIA CIENTIFICA",1603,2524,{"$f":"VLOOKUP(A7:A445,'[2]ABRIL 2020'!$B$3:$M$584,12,0)","v":"2020-04-20"},"https://www.contratos.gov.co/consultas/detalleProceso.do?numConstancia=20-4-10688568"]
[22736159,"ARACELLY HERNANDEZ GARCIA ",1328,"1328-2020","DIGITADOR PAI WEB ","01 de Abril de 2020","  30 de Abril de  2020",2500000,2500000,"NILSA ARIZA MARQUEZ","COORDINADOR PYP",1604,2525,{"$f":"VLOOKUP(A8:A446,'[2]ABRIL 2020'!$B$3:$M$584,12,0)","v":"2020-04-20"},"https://www.contratos.gov.co/consultas/detalleProceso.do?numConstancia=20-4-10688585"]
[1140850083,"ARLINY YANNINY RAMIREZ FIGUEROA",1329,"1329-2020","ASESOR DE PRESUPUESTO","01 de Abril de 2020","  30 de Abril de  2020",4000000,4000000,"ALFONSO NICOLAS OQUENDO","DIRECTOR FINANCIERO",1605,2526,{"$f":"VLOOKUP(A9:A446,'[2]ABRIL 2020'!$B$3:$M$584,12,0)","v":"2020-04-20"},"https://www.contratos.gov.co/consultas/detalleProceso.do?numConstancia=20-4-10688600"]
[1042444527,"ARNOLD RINCON MARTINEZ",1330,"1330-2020","PROFESIONAL PLANEACION ESTRATEGICA","01 de Abril de 2020","  30 de Abril de  2020",4000000,4000000,"SANDRA SANMARTIN","SUBGENTE ADMINISTRATIVO",1606,2527,{"$f":"VLOOKUP(A10:A446,'[2]ABRIL 2020'!$B$3:$M$584,12,0)","v":"2020-04-20"},"https://www.contratos.gov.co/consultas/detalleProceso.do?numConstancia=20-4-10688614"]
[64580944,"BIBIANA MARIA DIAZ RUIZ ",1331,"1331-2020","ASISTENTE SUBGERENCIA CIENTIFICA ","01 de Abril de 2020","  30 de Abril de  2020",5800000,5800000,"BETTY PERTUZ ","SUBGERENCIA CIENTIFICA",1607,2528,{"$f":"VLOOKUP(A11:A446,'[2]ABRIL 2020'!$B$3:$M$584,12,0)","v":"2020-04-20"},"https://www.contratos.gov.co/consultas/detalleProceso.do?numConstancia=20-4-10688614"]
[5055447,"CARLOS ALBERTO CARBONELL ALVAREZ",{"$f":"+C11+1","v":1332},"1332-2020","AUDITOR MEDICO","01 de Abril de 2020","  30 de Abril de  2020",4500000,{"$f":"+H12*1","v":4500000},"BETTY PERTUZ ","SUBGERENCIA CIENTIFICA",1608,2529,{"$f":"VLOOKUP(A12:A446,'[2]ABRIL 2020'!$B$3:$M$584,12,0)","v":"2020-04-20"},"https://www.contratos.gov.co/consultas/detalleProceso.do?numConstancia=20-4-10688789"]
[22549719,"CARMEN MELINA BOLAÑO COTES ",1333,"1333-2020","AUXILIAR ADMINISTRATIVO- ESTADISTICA","01 de Abril de 2020","  30 de Abril de  2020",1900000,1900000,"SANDRA SANMARTIN","SUBGENTE ADMINISTRATIVO",1609,2530,{"$f":"VLOOKUP(A13:A446,'[2]ABRIL 2020'!$B$3:$M$584,12,0)","v":"2020-04-20"},"https://www.contratos.gov.co/consultas/detalleProceso.do?numConstancia=20-4-10688802"]
[8762035,"CESAR AUGUSTO MERIÑO ESCORCIA ",1334,"1334-2020","ORIENTADOR","01 de Abril de 2020","  30 de Abril de  2020",1270000,1270000,"SANDRA SANMARTIN","SUBGENTE ADMINISTRATIVO",1610,2531,{"$f":"VLOOKUP(A14:A446,'[2]ABRIL 2020'!$B$3:$M$584,12,0)","v":"2020-04-20"},"https://www.contratos.gov.co/consultas/detalleProceso.do?numConstancia=20-4-10688834"]
[1001798325,"CINDY MILENA SARMIENTO MERIÑO",1335,"1335-2020","PROFESIONA RELACIONES INETRNACIONALES","01 de Abril de 2020","  30 de Abril de  2020",4000000,4000000,"FABIAN COLPAS","JEFE  TALENTO  HUMANO",1611,2532,{"$f":"VLOOKUP(A15:A446,'[2]ABRIL 2020'!$B$3:$M$584,12,0)","v":"2020-04-20"},"https://www.contratos.gov.co/consultas/detalleProceso.do?numConstancia=20-4-10688848"]
[32769708,"CLAUDIA ARENAS ALVAREZ",1336,"1336-2020","APOYO GESTION CONTROL INTERNO","01 de Abril de 2020","  30 de Abril de  2020",3500000,3500000,"SANDRA SANMARTIN","SUBGENTE ADMINISTRATIVO",1612,2533,{"$f":"VLOOKUP(A16:A446,'[2]ABRIL 2020'!$B$3:$M$584,12,0)","v":"2020-04-20"},"https://www.contratos.gov.co/consultas/detalleProceso.do?numConstancia=20-4-10688853"]
[1043611198,"CRISTIAN JESUS RODRIGUEZ QUIROZ",1337,"1337-2020","AUXILIAR PRESUPUESTO","01 de Abril de 2020","  30 de Abril de  2020",1900000,1900000,"ALFONSO NICOLAS OQUENDO","DIRECTOR FINANCIERO",1613,2534,{"$f":"VLOOKUP(A17:A446,'[2]ABRIL 2020'!$B$3:$M$584,12,0)","v":"2020-04-20"},"https://www.contratos.gov.co/consultas/detalleProceso.do?numConstancia=20-4-10688877"]
[1000149163,"DAVID RICARDO BOTERO ALONSO",1338,"1338-2020","APOYO GESTION DOCUMENTAL JURIDICA","01 de Abril de 2020","  30 de Abril de  2020",4000000,4000000,"ORNELLA FIORENTINO ","JEFE DE JURIDICA",1614,2535,{"$f":"VLOOKUP(A18:A446,'[2]ABRIL 2020'!$B$3:$M$584,12,0)","v":"2020-04-20"},"https://www.contratos.gov.co/consultas/detalleProceso.do?numConstancia=20-4-10688900"]
[44157462,"DAYAN MARTINEZ PACHECO",1339,"1339-2020","ABOGADO EXTERNO","01 de Abril de 2020","  30 de Abril de  2020",5000000,5000000,"ORNELLA FIORENTINO ","JEFE DE JURIDICA",1615,2536,{"$f":"VLOOKUP(A19:A446,'[2]ABRIL 2020'!$B$3:$M$584,12,0)","v":"2020-04-20"},"https://www.contratos.gov.co/consultas/detalleProceso.do?numConstancia=20-4-10688912"]
[19615791,"DIOMAR NAVARRO ANGARITA",1340,"1340-2020","RECUPERACION DE CARTERA ","01 de Abril de 2020","  30 de Abril de  2020",2000000,2000000,"ORNELLA FIORENTINO","JEFE JURIDICA",1616,2537,{"$f":"VLOOKUP(A20:A446,'[2]ABRIL 2020'!$B$3:$M$584,12,0)","v":"2020-04-20"},"https://www.contratos.gov.co/consultas/detalleProceso.do?numConstancia=20-4-10688934"]
[22704983,"EGUIS ODILA ROLONG LAGUNA",1341,"1341-2020","ABOGADO EXTERNO","01 de Abril de 2020","  30 de Abril de  2020",4000000,4000000,"FABIAN COLPAS","JEFE  TALENTO  HUMANO",1617,2538,{"$f":"VLOOKUP(A21:A446,'[2]ABRIL 2020'!$B$3:$M$584,12,0)","v":"2020-04-20"},"https://www.contratos.gov.co/consultas/detalleProceso.do?numConstancia=20-4-10688988"]
[32787164,"ELIANA CONSTANZA ARTETA HOYOS",1342,"1342-2020","CONTADOR","01 de Abril de 2020","  30 de Abril de  2020",4000000,4000000,"SANDRA SANMARTIN","SUBGENTE ADMINISTRATIVO",1618,2539,{"$f":"VLOOKUP(A22:A446,'[2]ABRIL 2020'!$B$3:$M$584,12,0)","v":"2020-04-20"},"https://www.contratos.gov.co/consultas/detalleProceso.do?numConstancia=20-4-10689037"]
[8633055,"ELIECER POLO CASTRO ",1343,"1343-2020","ABOGADO EXTERNO","01 de Abril de 2020","  30 de Abril de  2020",5800000,5800000,"ORNELLA FIORENTINO ","JEFE DE JURIDICA",1619,2540,{"$f":"VLOOKUP(A23:A446,'[2]ABRIL 2020'!$B$3:$M$584,12,0)","v":"2020-04-20"},"https://www.contratos.gov.co/consultas/detalleProceso.do?numConstancia=20-4-10689055"]
[1140831753,"ENNY CAROLINA ROCHA HERNANDEZ",1344,"1344-2020","ABOGADO EXTERNO","01 de Abril de 2020","  30 de Abril de  2020",5000000,5000000,"ORNELLA FIORENTINO ","JEFE DE JURIDICA",1620,2541,{"$f":"VLOOKUP(A24:A446,'[2]ABRIL 2020'!$B$3:$M$584,12,0)","v":"2020-04-20"},"https://www.contratos.gov.co/consultas/detalleProceso.do?numConstancia=20-4-10689083"]
[32866006,"ERIKA ASCENCIO MARQUEZ",1345,"1345-2020","PROFESIONAL -CONTRATACION ","01 de Abril de 2020","  30 de Abril de  2020",3500000,3500000,"ORNELLA FIORENTINO ","JEFE DE JURIDICA",1621,2542,{"$f":"VLOOKUP(A25:A446,'[2]ABRIL 2020'!$B$3:$M$584,12,0)","v":"2020-04-20"},"https://www.contratos.gov.co/consultas/detalleProceso.do?numConstancia=20-4-10689099"]
[32583911,"EVA ISABEL ROSALES NAVARRO",1346,"1346-2020","ASESOR GERENCIA","01 de Abril de 2020","  30 de Abril de  2020",5000000,5000000,"ROSA MADERA","GERENTE",1622,2543,{"$f":"VLOOKUP(A26:A446,'[2]ABRIL 2020'!$B$3:$M$584,12,0)","v":"2020-04-20"},"https://www.contratos.gov.co/consultas/detalleProceso.do?numConstancia=20-4-10689134"]
[22504109,"FLOR MILENA GOICOECHEA OROZCO",1347,"1347-2020","AUXILIAR DE FACTURACIÓN ","01 de Abril de 2020","  30 de Abril de  2020",2500000,2500000,"SANDRA SANMARTIN","SUBGENTE ADMINISTRATIVO",1623,2544,{"$f":"VLOOKUP(A27:A446,'[2]ABRIL 2020'!$B$3:$M$584,12,0)","v":"2020-04-20"},"https://www.contratos.gov.co/consultas/detalleProceso.do?numConstancia=20-4-10689146"]
[72328953,"FRANCISCO ALCIDES CARRANZA MENDOZA",1348,"1348-2020","AUXILIAR RECURSOS FISICOS ","01 de Abril de 2020","  30 de Abril de  2020",1900000,1900000,"SANDRA SANMARTIN","SUBGENTE ADMINISTRATIVO",1624,2545,{"$f":"VLOOKUP(A28:A446,'[2]ABRIL 2020'!$B$3:$M$584,12,0)","v":"2020-04-20"},"https://www.contratos.gov.co/consultas/detalleProceso.do?numConstancia=20-4-10689162"]
[1042416953,"GABRIEL JOSE MONTIEL CERVANTES",1349,"1349-2020","COORDINADOR DE HARDWARE","01 de Abril de 2020","  30 de Abril de  2020",3000000,3000000,"ZULI ROMERO","COORDINADORA  TIC",1625,2546,{"$f":"VLOOKUP(A29:A446,'[2]ABRIL 2020'!$B$3:$M$584,12,0)","v":"2020-04-20"},"https://www.contratos.gov.co/consultas/detalleProceso.do?numConstancia=20-4-10689169"]
[1143425564,"HECTOR JOSE BARRAZA GUTIERREZ",1350,"1350-2020","ASESOR DE PRESUPUESTO","01 de Abril de 2020","  30 de Abril de  2020",4000000,4000000,"ALFONSO NICOLAS OQUENDO ","DIRECTOR FINANCIERO",1626,2547,{"$f":"VLOOKUP(A30:A446,'[2]ABRIL 2020'!$B$3:$M$584,12,0)","v":"2020-04-20"},"https://www.contratos.gov.co/consultas/detalleProceso.do?numConstancia=20-4-10689176"]
{"$rows_left_out":417}
{"sheet":"PIC ABRIL ","index":1,"n_rows":64,"n_cols":15,"rows_kept":64,"cut":false,"hidden":false,"merged":[[0,0,1,3]]}
["LISTADO DE CONTRATACION  PIC -MES DE ABRIL 2020"]
[]
["CEDULA","NOMBRE Y APELLIDO","#OPS","FECHA INICIO","FECHA TERMINACION ","OBJETO DEL CONTRATO","VALOR MENSUAL","VALOR TOTAL ","VALOR LETRAS total","SUPERVISOR ","CARGO","CDP","RP","FECHA  SECOP ","LINK SECOOP"]
[55236945,"ADRIANA PATRICIA MARQUEZ CANTILLO","0070-2020-PIC ","01 de Abril de 2020","30 de Abril de  2020","VACUNADORA",1400000,{"$f":"G4*1","v":1400000},{"$f":"[1]!PesosMN(H4)","v":{"$error":"#NAME?"}},"NILSA ARIZA MARQUEZ","COORDINADOR P Y P",2038,2959,"2020-04-20",{"$f":"VLOOKUP(A4:A64,'[3]PIC ABRIL '!$B$4:$AM$70,38,0)","v":"https://www.contratos.gov.co/consultas/detalleProceso.do?numConstancia=20-4-10716385"}]
[22643912,"ANGELA ROSA MORALES SANMARTIN","0071-2020-PIC ","01 de Abril de 2020","30 de Abril de  2020","VACUNADORA",1400000,1400000,{"$error":"#NAME?"},"NILSA ARIZA MARQUEZ","COORDINADOR P Y P",2039,2960,"2020-04-20",{"$f":"VLOOKUP(A5:A64,'[3]PIC ABRIL '!$B$4:$AM$70,38,0)","v":"https://www.contratos.gov.co/consultas/detalleProceso.do?numConstancia=20-4-10716395"}]
[32826839,"BEATRIZ ISABEL SANMARTIN ESCORCIA","0072-2020-PIC ","01 de Abril de 2020","30 de Abril de  2020","VACUNADORA",1400000,1400000,{"$error":"#NAME?"},"NILSA ARIZA MARQUEZ","COORDINADOR P Y P",2040,2961,"2020-04-20",{"$f":"VLOOKUP(A6:A64,'[3]PIC ABRIL '!$B$4:$AM$70,38,0)","v":"https://www.contratos.gov.co/consultas/detalleProceso.do?numConstancia=20-4-10716401"}]
[1047337919,"CANDY ISABEL ROJAS SARMIENTO","0073-2020-PIC ","01 de Abril de 2020","30 de Abril de  2020","APOYO A LA GESTION DIMENSIÓN_DE_SALUD_AMBIENTAL: Zoonosis",1400000,1400000,{"$error":"#NAME?"},"NILSA ARIZA MARQUEZ","COORDINADOR PYP",2041,2962,"2020-04-20",{"$f":"VLOOKUP(A7:A64,'[3]PIC ABRIL '!$B$4:$AM$70,38,0)","v":"https://www.contratos.gov.co/consultas/detalleProceso.do?numConstancia=20-4-10716406"}]
[32744712,"CARMEN MARIA CORONADO ESCORCIA","0074-2020-PIC ","01 de Abril de 2020","30 de Abril de  2020","ENFERMERA JEFE -PIC",2500000,2500000,{"$error":"#NAME?"},"BETTY PERTUZ","SUBGERENTE CIENTIFICO",2042,2963,"2020-04-20",{"$f":"VLOOKUP(A8:A64,'[3]PIC ABRIL '!$B$4:$AM$70,38,0)","v":"https://www.contratos.gov.co/consultas/detalleProceso.do?numConstancia=20-4-10716409"}]
[32876278,"CLAUDIA MARTINEZ RIVAS ","0075-2020-PIC ","01 de Abril de 2020","30 de Abril de  2020","AGENTE EN ATENCION PRIMARIA EN SALUD",1400000,1400000,{"$error":"#NAME?"},"NILSA ARIZA MARQUEZ","COORDINADOR PYP",2043,2964,"2020-04-20",{"$f":"VLOOKUP(A9:A64,'[3]PIC ABRIL '!$B$4:$AM$70,38,0)","v":"https://www.contratos.gov.co/consultas/detalleProceso.do?numConstancia=20-4-10716413"}]
[8784783,"DAIRO MANRIQUEZ MORALES BOVEA","0076-2020-PIC ","01 de Abril de 2020","30 de Abril de  2020","APOYO A LA GESTION DIMENSIÓN_DE_SALUD_AMBIENTAL: Zoonosis",1400000,1400000,{"$error":"#NAME?"},"NILSA ARIZA MARQUEZ","COORDINADOR PYP",2044,2965,"2020-04-20",{"$f":"VLOOKUP(A10:A64,'[3]PIC ABRIL '!$B$4:$AM$70,38,0)","v":"https://www.contratos.gov.co/consultas/detalleProceso.do?numConstancia=20-4-10716417"}]
[1046814365,"DESIRETH DEL CARMEN DE LEON ATENCIA","0077-2020-PIC ","01 de Abril de 2020","30 de Abril de  2020","VACUNADORA",1400000,1400000,{"$error":"#NAME?"},"NILSA ARIZA MARQUEZ","COORDINADOR P Y P",2045,2966,"2020-04-20",{"$f":"VLOOKUP(A11:A64,'[3]PIC ABRIL '!$B$4:$AM$70,38,0)","v":"https://www.contratos.gov.co/consultas/detalleProceso.do?numConstancia=20-4-10716421"}]
[32824393,"ELIZABETH RODRIGUEZ BARRIOS","0078-2020-PIC ","01 de Abril de 2020","30 de Abril de  2020","VACUNADORA",1400000,1400000,{"$error":"#NAME?"},"NILSA ARIZA MARQUEZ","COORDINADOR P Y P",2046,2967,"2020-04-20",{"$f":"VLOOKUP(A12:A64,'[3]PIC ABRIL '!$B$4:$AM$70,38,0)","v":"https://www.contratos.gov.co/consultas/detalleProceso.do?numConstancia=20-4-10716425"}]
[22467133,"ESMERALDA COTE BORNACELY ","0079-2020-PIC ","01 de Abril de 2020","30 de Abril de  2020","VACUNADORA",1400000,1400000,{"$error":"#NAME?"},"NILSA ARIZA MARQUEZ","COORDINADOR P Y P",2047,2968,"2020-04-20",{"$f":"VLOOKUP(A13:A64,'[3]PIC ABRIL '!$B$4:$AM$70,38,0)","v":"https://www.contratos.gov.co/consultas/detalleProceso.do?numConstancia=20-4-10716429"}]
[22446125,"GENOVEVA MARIA LLANES JEREZ","0080-2020-PIC ","01 de Abril de 2020","30 de Abril de  2020","VACUNADORA",1400000,1400000,{"$error":"#NAME?"},"NILSA ARIZA MARQUEZ","COORDINADOR P Y P",2048,2969,"2020-04-20",{"$f":"VLOOKUP(A14:A64,'[3]PIC ABRIL '!$B$4:$AM$70,38,0)","v":"https://www.contratos.gov.co/consultas/detalleProceso.do?numConstancia=20-4-10716431"}]
[49775980,"GLORIA HERNANDEZ CENTENO","0081-2020-PIC ","01 de Abril de 2020","30 de Abril de  2020","VACUNADORA",1400000,1400000,{"$error":"#NAME?"},"NILSA ARIZA MARQUEZ","COORDINADOR P Y P",2049,2970,"2020-04-20",{"$f":"VLOOKUP(A15:A64,'[3]PIC ABRIL '!$B$4:$AM$70,38,0)","v":"https://www.contratos.gov.co/consultas/detalleProceso.do?numConstancia=20-4-10716436"}]
[8767993,"HAROLD MANUEL CABARCAS GONZALEZ","0082-2020-PIC ","01 de Abril de 2020","30 de Abril de  2020","VACUNADORA",1400000,1400000,{"$error":"#NAME?"},"NILSA ARIZA MARQUEZ","COORDINADOR P Y P",2050,2971,"2020-04-20",{"$f":"VLOOKUP(A16:A64,'[3]PIC ABRIL '!$B$4:$AM$70,38,0)","v":"https://www.contratos.gov.co/consultas/detalleProceso.do?numConstancia=20-4-10716440"}]
[64578458,"ILDA DEL PILAR PACHECO AGUIRRE","0083-2020-PIC ","01 de Abril de 2020","30 de Abril de  2020","VACUNADORA ",1400000,1400000,{"$error":"#NAME?"},"NILSA ARIZA MARQUEZ","COORDINADOR P Y P",2051,2972,"2020-04-20",{"$f":"VLOOKUP(A17:A64,'[3]PIC ABRIL '!$B$4:$AM$70,38,0)","v":"https://www.contratos.gov.co/consultas/detalleProceso.do?numConstancia=20-4-10716444"}]
[32619158,"ISABEL HERRERA PACHECO","0084-2020-PIC ","01 de Abril de 2020","30 de Abril de  2020","VACUNADORA- CUARTO FRIO",1600000,1600000,{"$error":"#NAME?"},"NILSA ARIZA MARQUEZ","COORDINADOR P Y P",2052,2973,"2020-04-20",{"$f":"VLOOKUP(A18:A64,'[3]PIC ABRIL '!$B$4:$AM$70,38,0)","v":"https://www.contratos.gov.co/consultas/detalleProceso.do?numConstancia=20-4-10716449"}]
[32816898,"ISABEL OSORIO BARRIOS","0085-2020-PIC ","01 de Abril de 2020","30 de Abril de  2020","VACUNADORA",1400000,1400000,{"$error":"#NAME?"},"NILSA ARIZA MARQUEZ","COORDINADOR P Y P",2053,2974,"2020-04-20",{"$f":"VLOOKUP(A19:A64,'[3]PIC ABRIL '!$B$4:$AM$70,38,0)","v":"https://www.contratos.gov.co/consultas/detalleProceso.do?numConstancia=20-4-10716453"}]
[1045675584,"ISOREIDA PEREZ PALMEIRA","0086-2020-PIC ","01 de Abril de 2020","30 de Abril de  2020","ENFERMERA JEFE APS -PIC",2500000,2500000,{"$error":"#NAME?"},"BETTY PERTUZ","SUBGERENTE CIENTIFICO",2054,2975,"2020-04-20",{"$f":"VLOOKUP(A20:A64,'[3]PIC ABRIL '!$B$4:$AM$70,38,0)","v":"https://www.contratos.gov.co/consultas/detalleProceso.do?numConstancia=20-4-10716454"}]
[22431886,"IVIS GONZALEZ AYARZA","0087-2020-PIC ","01 de Abril de 2020","30 de Abril de  2020","VACUNADORA",1400000,1400000,{"$error":"#NAME?"},"NILSA ARIZA MARQUEZ","COORDINADOR P Y P",2055,2976,"2020-04-20",{"$f":"VLOOKUP(A21:A64,'[3]PIC ABRIL '!$B$4:$AM$70,38,0)","v":"https://www.contratos.gov.co/consultas/detalleProceso.do?numConstancia=20-4-10716459"}]
[3779189,"JAIME ENRIQUE MARQUEZ VILLAFAÑE","0088-2020-PIC ","01 de Abril de 2020","30 de Abril de  2020","APOYO A LA GESTION DIMENSIÓN_DE_SALUD_AMBIENTAL: Zoonosis",1400000,1400000,{"$error":"#NAME?"},"NILSA ARIZA MARQUEZ","COORDINADOR PYP",2056,2977,"2020-04-20",{"$f":"VLOOKUP(A22:A64,'[3]PIC ABRIL '!$B$4:$AM$70,38,0)","v":"https://www.contratos.gov.co/consultas/detalleProceso.do?numConstancia=20-4-10716461"}]
[32829868,"JUDITH ISABEL ARCON MEDINA","0089-2020-PIC ","01 de Abril de 2020","30 de Abril de  2020","APOYO A LA GESTION DIMENSIÓN_DE_SALUD_AMBIENTAL: Zoonosis",1400000,1400000,{"$error":"#NAME?"},"NILSA ARIZA MARQUEZ","COORDINADOR PYP",2057,2978,"2020-04-20",{"$f":"VLOOKUP(A23:A64,'[3]PIC ABRIL '!$B$4:$AM$70,38,0)","v":"https://www.contratos.gov.co/consultas/detalleProceso.do?numConstancia=20-4-10716465"}]
[32865375,"LEDIA DEL CARMEN MARTINEZ DE MOYA","0090-2020-PIC ","01 de Abril de 2020","30 de Abril de  2020","VACUNADORA",1400000,1400000,{"$error":"#NAME?"},"NILSA ARIZA MARQUEZ","COORDINADOR P Y P",2058,2979,"2020-04-20",{"$f":"VLOOKUP(A24:A64,'[3]PIC ABRIL '!$B$4:$AM$70,38,0)","v":"https://www.contratos.gov.co/consultas/detalleProceso.do?numConstancia=20-4-10716470"}]
[44159904,"LIZLEIDYS OSORIO DOMINGUEZ","0091-2020-PIC ","01 de Abril de 2020","30 de Abril de  2020","ENFERMERA-JEFE TERRENO PAI",2120000,2120000,{"$error":"#NAME?"},"BETTY PERTUZ","SUBGERENTE CIENTIFICO",2059,2980,"2020-04-20",{"$f":"VLOOKUP(A25:A64,'[3]PIC ABRIL '!$B$4:$AM$70,38,0)","v":"https://www.contratos.gov.co/consultas/detalleProceso.do?numConstancia=20-4-10716475"}]
[1046698080,"LUIS ALFREDO CANTILLO CABALLERO","0092-2020-PIC ","01 de Abril de 2020","30 de Abril de  2020","APOYO A LA GESTION DIMENSIÓN_DE_SALUD_AMBIENTAL: Zoonosis",1400000,1400000,{"$error":"#NAME?"},"NILSA ARIZA MARQUEZ","COORDINADOR PYP",2060,2981,"2020-04-20",{"$f":"VLOOKUP(A26:A64,'[3]PIC ABRIL '!$B$4:$AM$70,38,0)","v":"https://www.contratos.gov.co/consultas/detalleProceso.do?numConstancia=20-4-10716479"}]
[1043185696,"MANUEL ZULBARAN ","0093-2020-PIC ","01 de Abril de 2020","30 de Abril de  2020","APOYO A LA GESTION DIMENSIÓN_DE_SALUD_AMBIENTAL: Zoonosis",1400000,1400000,{"$error":"#NAME?"},"NILSA ARIZA MARQUEZ","COORDINADOR PYP",2061,2982,"2020-04-20",{"$f":"VLOOKUP(A27:A64,'[3]PIC ABRIL '!$B$4:$AM$70,38,0)","v":"https://www.contratos.gov.co/consultas/detalleProceso.do?numConstancia=20-4-10716485"}]
[30895455,"MARIA CONCEPCION ESPRIELLA BUELVAS","0094-2020-PIC ","01 de Abril de 2020","30 de Abril de  2020","APOYO A LA GESTION DIMENSIÓN_DE_SALUD_AMBIENTAL: Zoonosis",1400000,1400000,{"$error":"#NAME?"},"NILSA ARIZA MARQUEZ","COORDINADOR PYP",2062,2983,"2020-04-20",{"$f":"VLOOKUP(A28:A64,'[3]PIC ABRIL '!$B$4:$AM$70,38,0)","v":"https://www.contratos.gov.co/consultas/detalleProceso.do?numConstancia=20-4-10716489"}]
[22430756,"MARITZA MARINO OSORIO","0095-2020-PIC ","01 de Abril de 2020","30 de Abril de  2020","VACUNADORA ",1400000,1400000,{"$error":"#NAME?"},"NILSA ARIZA MARQUEZ","COORDINADOR P Y P",2063,2984,"2020-04-20",{"$f":"VLOOKUP(A29:A64,'[3]PIC ABRIL '!$B$4:$AM$70,38,0)","v":"https://www.contratos.gov.co/consultas/detalleProceso.do?numConstancia=20-4-10716498"}]
[1143136225,"MARTA CECILIA MARIN ZAPATA","0096-2020-PIC ","01 de Abril de 2020","30 de Abril de  2020","AGENTE EN ATENCION PRIMARIA EN SALUD",1400000,1400000,{"$error":"#NAME?"},"NILSA ARIZA MARQUEZ","COORDINADOR PYP",2064,2985,"2020-04-20",{"$f":"VLOOKUP(A30:A64,'[3]PIC ABRIL '!$B$4:$AM$70,38,0)","v":"https://www.contratos.gov.co/consultas/detalleProceso.do?numConstancia=20-4-10716503"}]
{"$rows_left_out":35}
{"sheet":"Hoja1","index":2,"n_rows":0,"n_cols":0,"rows_kept":0,"cut":false,"hidden":false,"merged":[]}