{"text_format":"1","workbook":"xlsx","n_sheets":2,"sheets":["JULIO ","PIC JULIO 2020"],"not_rendered":{"charts":0,"images":0,"macros":1,"external_links":2,"defined_names":3,"comments":2,"pivot_tables":0},"unopened":[],"bounds":{"document_bytes":16777216,"sheet_cells":100000,"rows_first":2000,"rows_last":500,"rows_between":2000,"halvings":0,"cell_chars":16384,"cell_head_chars":4096},"cells_cut":0,"cells_raw":0,"read":"whole","date_system":"1900"}

{"sheet":"JULIO ","index":0,"n_rows":475,"n_cols":15,"rows_kept":475,"cut":false,"hidden":false,"merged":[[0,1,0,5]]}
[null,"LISTADO CONTRATACION MES DE JULIO DE 2020"]
["NO","CEDULA","NOMBRES APELLIDOS CONTRATISTA","ops  #año","OBJETO DEL CONTRATO","FECHA INICIO","FECHA TERMINACION ","VALOR MENSUAL","VALOR TOTAL ","CDP","RP","SUPERVISOR ","CARGO","FECHA  SECOP ","LINK SECOP "]
[1,32726703,"MARILYN ESTHER PEREZ LIÑAN","2669-2020","AUXILIAR DE ENFERMERIA URGENCIAS","01 deJulio de 2020"," 31 de  Julio  de 2020",1653600,{"$f":"+H3*1","v":1653600},3263,4253,"SERGIO BOVEA MARIN","COORD CENTRO DE SALUD","2020-07-17","https://www.contratos.gov.co/consultas/detalleProceso.do?numConstancia=20-4-10932901"]
[{"$f":"+A3+1","v":2},1129532724,"MICHELLY SANDOVAL ACUÑA","2670-2020","AUDITOR MEDICO  - EPIDEMIOLOGA  COORDINACION- EMERGENCIA COVIC 19","01 deJulio de 2020"," 31 de  Julio  de 2020",6044000,6044000,3272,4254,"BETTY PERTUZ ","SUBGERENTE CIENTIFICO","2020-07-17","https://www.contratos.gov.co/consultas/detalleProceso.do?numConstancia=20-4-10932921"]
[3,32870174,"SIRLEY PAOLA PEREZ CARMONA","2671-2020","AUDITOR DE CALIDAD Y SERVICIOS DE SALUD","01 deJulio de 2020"," 31 de  Julio  de 2020",5800000,5800000,3273,4255,"BETTY PERTUZ ","SUBGERENTE CIENTIFICO","2020-07-17","https://www.contratos.gov.co/consultas/detalleProceso.do?numConstancia=20-4-10932926"]
[4,1140846298,"LENIN ALVAREZ PINEDA","2672-2020","AUDITOR DE SISTEMAS Y RESOLUCION 4505","01 deJulio de 2020"," 31 de  Julio  de 2020",3000000,3000000,3274,4256,"NILSA ARIZA MARQUEZ","COORDINADOR PYP","2020-07-17","https://www.contratos.gov.co/consultas/detalleProceso.do?numConstancia=20-4-10932935"]
[5,22736159,"ARACELLY HERNANDEZ GARCIA ","2673-2020","AUXILIAR ADMINISTRATIVO TIC  Y SISTEMA DE INFORMACION","01 deJulio de 2020"," 31 de  Julio  de 2020",2500000,2500000,3275,4257,"ZULLY ROMERO","COORDINADOR TIC","2020-07-17","https://www.contratos.gov.co/consultas/detalleProceso.do?numConstancia=20-4-10932942"]
[6,1042416953,"GABRIEL JOSE MONTIEL CERVANTES","2674-2020","INGENIERO DE REDES Y HARDWARE ","01 deJulio de 2020"," 31 de  Julio  de 2020",3000000,3000000,3276,4258,"ZULLY ROMERO","COORDINADOR TIC","2020-07-17","https://www.contratos.gov.co/consultas/detalleProceso.do?numConstancia=20-4-10932948"]
[7,1043121395,"SHEYLA DEL CARMEN ESTRADA ARIZA","2675-2020","TECNICO DE SISTEMAS ","01 deJulio de 2020"," 31 de  Julio  de 2020",1270000,1270000,3277,4259,"ZULLY ROMERO","COORDINADOR TIC","2020-07-17","https://www.contratos.gov.co/consultas/detalleProceso.do?numConstancia=20-4-10932958"]
[8,8762035,"CESAR AUGUSTO MERIÑO ESCORCIA ","2676-2020","ORIENTADOR","01 deJulio de 2020"," 31 de  Julio  de 2020",1270000,1270000,3278,4260,"SANDRA SANMARTIN","SUBGERENTE ADMINISTRATIVO","2020-07-17","https://www.contratos.gov.co/consultas/detalleProceso.do?numConstancia=20-4-10932967"]
[9,1140814033,"STEFANY RINCON TORRES","2677-2020","ASISTENTE ADMINISTRATIVO- COORD EMERGENCIA COVIC 19","01 deJulio de 2020"," 31 de  Julio  de 2020",4000000,4000000,3279,4261,"BETTY PERTUZ ","SUBGERENTE CIENTIFICO","2020-07-17","https://www.contratos.gov.co/consultas/detalleProceso.do?numConstancia=20-4-10932975"]
[10,1140874429,"ALBERTO DE LA OSSA DE AVILA","2678-2020","PROFESIONAL  PRESUPUESTO ","01 deJulio de 2020"," 31 de  Julio  de 2020",3000000,3000000,3280,4262,"JORGE OLMOS NAVARRO","DIRECTOR FINANCIERO","2020-07-17","https://www.contratos.gov.co/consultas/detalleProceso.do?numConstancia=20-4-10932984"]
[11,22549719,"CARMEN MELINA BOLAÑO COTES ","2679-2020","AUXILIAR ADMINISTRATIVO  ESTADISTICA","01 deJulio de 2020"," 31 de  Julio  de 2020",2500000,2500000,3281,4263,"GENARO   GUTIERREZ DE PIÑERES","JEFE DE  ESTADISTICA","2020-07-17","https://www.contratos.gov.co/consultas/detalleProceso.do?numConstancia=20-4-10932989"]
[12,1001798325,"CINDY MILENA SARMIENTO MERIÑO","2680-2020","ESPECIALISTA TALENTO HUMANO ","01 deJulio de 2020"," 31 de  Julio  de 2020",4000000,4000000,3282,4264,"FABIAN  COLPAS OROZCO ","JEFE  TALENTO  HUMANO","2020-07-17","https://www.contratos.gov.co/consultas/detalleProceso.do?numConstancia=20-4-10932995"]
[13,32769708,"CLAUDIA ARENAS ALVAREZ","2681-2020","APOYO GESTION CONTROL INTERNO","01 deJulio de 2020"," 31 de  Julio  de 2020",3500000,3500000,3283,4265,"SANDRA SANMARTIN","SUBGERENTE ADMINISTRATIVO","2020-07-17","https://www.contratos.gov.co/consultas/detalleProceso.do?numConstancia=20-4-10933001"]
[14,1043611198,"CRISTIAN JESUS RODRIGUEZ QUIROZ","2682-2020","PROFESIONAL CONTADURIA","01 deJulio de 2020"," 31 de  Julio  de 2020",3000000,3000000,3284,4266,"JORGE OLMOS NAVARRO","DIRECTOR FINANCIERO","2020-07-17","https://www.contratos.gov.co/consultas/detalleProceso.do?numConstancia=20-4-10933013"]
[15,22704983,"EGUIS ODILA ROLONG LAGUNA","2683-2020","ABOGADO  TALENTO HUMANO","01 deJulio de 2020"," 31 de  Julio  de 2020",5000000,5000000,3285,4267,"FABIAN  COLPAS OROZCO ","JEFE  TALENTO  HUMANO","2020-07-17","https://www.contratos.gov.co/consultas/detalleProceso.do?numConstancia=20-4-10933018"]
[16,32866006,"ERIKA MARIA  ASCENCIO MARQUEZ","2684-2020","PROFESIONAL CONTRATACION   Y  SISTEMAS DE INFORMACION TALENTO HUMANO","01 deJulio de 2020"," 31 de  Julio  de 2020",4000000,4000000,3286,4268,"FABIAN  COLPAS OROZCO ","JEFE  TALENTO  HUMANO","2020-07-17","https://www.contratos.gov.co/consultas/detalleProceso.do?numConstancia=20-4-10933026"]
[17,8495176,"JAIME ALBERTO ALVAREZ NORIEGA","2685-2020","INGENIERO AMBIENTAL","01 deJulio de 2020"," 31 de  Julio  de 2020",3500000,3500000,3287,4269,"SANDRA SANMARTIN","SUBGERENTE ADMINISTRATIVO","2020-07-17","https://www.contratos.gov.co/consultas/detalleProceso.do?numConstancia=20-4-10933039"]
[18,1010137665,"KAROLINE JUDITH MORENO VARELO","2686-2020","ASISTENTE ADMINISTRATIVO PROMOCION Y PREVENCION.","01 deJulio de 2020"," 31 de  Julio  de 2020",1500000,1500000,3288,4270,"NILSA ARIZA MARQUEZ","COORDINADOR PYP","2020-07-17","https://www.contratos.gov.co/consultas/detalleProceso.do?numConstancia=20-4-10933049"]
[19,72053529,"LEINER DARIO MEDINA HERRERA","2687-2020","CONTROL INTERNO","01 deJulio de 2020"," 31 de  Julio  de 2020",3000000,3000000,3289,4271,"SANDRA SANMARTIN","SUBGERENTE ADMINISTRATIVO","2020-07-17","https://www.contratos.gov.co/consultas/detalleProceso.do?numConstancia=20-4-10933054"]
[20,8571868,"ERINSON RAFAEL GUZMAN DE  LA HOZ","2688-2020","PROFESIONAL TALENTO HUMANO","01 deJulio de 2020"," 31 de  Julio  de 2020",3000000,3000000,3290,4272,"FABIAN  COLPAS OROZCO ","JEFE  TALENTO  HUMANO","2020-07-17","https://www.contratos.gov.co/consultas/detalleProceso.do?numConstancia=20-4-10933061"]
[21,44205287,"MARTHA KATERINE MEJIA FRUTO","2689-2020","AUXILIAR ADMINISTRATIVO  RECEPCION ","01 deJulio de 2020"," 31 de  Julio  de 2020",1900000,1900000,3291,4273,"SANDRA SANMARTIN","SUBGERENTE ADMINISTRATIVO","2020-07-17","https://www.contratos.gov.co/consultas/detalleProceso.do?numConstancia=20-4-10933074"]
[22,1043876764,"MELANI ISABEL PERTUZ HERRERA","2690-2020","AUXILIAR ADMINISTRATIVO -  SUBGERENCIA ADMINISTRATIVA","01 deJulio de 2020"," 31 de  Julio  de 2020",2200000,2200000,3292,4274,"SANDRA SANMARTIN","SUBGERENTE ADMINISTRATIVO","2020-07-17","https://www.contratos.gov.co/consultas/detalleProceso.do?numConstancia=20-4-10933081"]
[23,72268005,"MILTON SOLARTE RODRIGUEZ","2691-2020","APOYO EN ANALISIS Y DESARROLLO DE  INFORMACION EN FACTURACION CENTRAL (RIPS)","01 deJulio de 2020"," 31 de  Julio  de 2020",3000000,3000000,3293,4275,"SANDRA SANMARTIN","SUBGERENTE ADMINISTRATIVO","2020-07-17","https://www.contratos.gov.co/consultas/detalleProceso.do?numConstancia=20-4-10933084"]
[24,55239101,"NATALI ANDREA NIEBLES JURADO","2692-2020","AUDITOR DE CALIDAD (LIDER DE UNIDAD)","01 deJulio de 2020"," 31 de  Julio  de 2020",5800000,5800000,3294,4276,"BETTY PERTUZ ","SUBGERENTE CIENTIFICO","2020-07-17","https://www.contratos.gov.co/consultas/detalleProceso.do?numConstancia=20-4-10933099"]
[25,1010179685,"NAYIVI OSPINA ARROYAVE","2693-2020","PROFESIONAL  SISTEMA DE GESTION Y SEGURIDAD EN EL TRABAJO","01 deJulio de 2020"," 31 de  Julio  de 2020",3500000,3500000,3295,4277,"FABIAN  COLPAS OROZCO ","JEFE  TALENTO  HUMANO","2020-07-17","https://www.contratos.gov.co/consultas/detalleProceso.do?numConstancia=20-4-10933110"]
[26,8603175,"NILSON ORTEGA JIMENEZ","2694-2020","AUXILIAR ADMINISTRATIVO  TALENTO HUMANO","01 deJulio de 2020"," 31 de  Julio  de 2020",2000000,2000000,3296,4278,"FABIAN  COLPAS OROZCO ","JEFE  TALENTO  HUMANO","2020-07-17","https://www.contratos.gov.co/consultas/detalleProceso.do?numConstancia=20-4-10933118"]
[27,1047340446,"OSCAR MAURICIO MARENCO ROMERO","2695-2020","ASISTENTE ADMINISTRATIVO ","01 deJulio de 2020"," 31 de  Julio  de 2020",1800000,1800000,3297,4279,"BETTY PERTUZ ","SUBGERENTE CIENTIFICO","2020-07-17","https://www.contratos.gov.co/consultas/detalleProceso.do?numConstancia=20-4-10933127"]
[28,22446590,"ROSALBA CERPA MIRANDA ","2696-2020","AUXILIAR ADMINISTRATIVO -  SUBGERENCIA CIENTIFICA","01 deJulio de 2020"," 31 de  Julio  de 2020",1900000,1900000,3298,4280,"BETTY PERTUZ ","SUBGERENTE CIENTIFICO","2020-07-17","https://www.contratos.gov.co/consultas/detalleProceso.do?numConstancia=20-4-10933135"]
{"$rows_left_out":446}
{"sheet":"PIC JULIO 2020","index":1,"n_rows":37,"n_cols":15,"rows_kept":37,"cut":false,"hidden":false,"merged":[]}
["CEDULA","NOMBRE Y APELLIDO","#OPS AÑO","OBJETO DEL CONTRATO","FECHA INICIO","FECHA TERMINACION ","VALOR MENSUAL","VALOR TOTAL ","SUPERVISOR ","CARGO","RUBRO PRESUPUESTAL ","CDP","RP","FECHA SECOP ","LINK SECOP "]
[22668428,"ANABELL VELASQUEZ FERNANDEZ ","212-2020 -PIC","COORDINADORA  PIC ","01 julio de 2020","31 de Julio de 2020",5800000,{"$f":"G2*1","v":5800000},"BETTY PERTUZ","SUBGERENTE CIENTIFICO","PIC",{"$f":"VLOOKUP(A2:A36,'[1]PIC JULIO 2020'!$A$2:$O$40,15,0)","v":3737},{"$f":"VLOOKUP(A2:A36,'[1]PIC JULIO 2020'!$A$2:$P$37,16,0)","v":4719},{"$f":"VLOOKUP(A2:A37,'[2]PIC JULIO 2020'!$A$2:$Q$40,17,0)","v":"2020-07-20"},"https://www.contratos.gov.co/consultas/detalleProceso.do?numConstancia=20-4-10938613"]
[32874188,"JALICSSA ARRIETA ORTEGA","213-2020 -PIC","APOYO  GESTION  PIC ","01 julio de 2020","31 de Julio de 2020",3500000,{"$f":"G3*1","v":3500000},"ANABELL VELASQUEZ","COORDINADORA PIC ","PIC",{"$f":"VLOOKUP(A3:A37,'[1]PIC JULIO 2020'!$A$2:$O$40,15,0)","v":3738},{"$f":"VLOOKUP(A3:A37,'[1]PIC JULIO 2020'!$A$2:$P$37,16,0)","v":4720},{"$f":"VLOOKUP(A3:A37,'[2]PIC JULIO 2020'!$A$2:$Q$40,17,0)","v":"2020-07-20"},"https://www.contratos.gov.co/consultas/detalleProceso.do?numConstancia=20-4-10938614"]
[32744712,"CARMEN MARIA CORONADO ESCORCIA","214-2020 -PIC","ENFERMERA JEFE -PIC","01 julio de 2020","31 de Julio de 2020",2500000,2500000,"ANABELL VELASQUEZ","COORDINADORA PIC ","PIC",{"$f":"VLOOKUP(A4:A37,'[1]PIC JULIO 2020'!$A$2:$O$40,15,0)","v":3739},{"$f":"VLOOKUP(A4:A37,'[1]PIC JULIO 2020'!$A$2:$P$37,16,0)","v":4721},{"$f":"VLOOKUP(A4:A37,'[2]PIC JULIO 2020'!$A$2:$Q$40,17,0)","v":"2020-07-20"},"https://www.contratos.gov.co/consultas/detalleProceso.do?numConstancia=20-4-10938615"]
[22506781,"MILDRED TATIANA GOENAGA ALVARADO","215-2020 -PIC","ENFERMERA  JEFE  VACUNACION ","01 julio de 2020","31 de Julio de 2020",2500000,2500000,"ANABELL VELASQUEZ","COORDINADORA PIC ","PIC",{"$f":"VLOOKUP(A5:A37,'[1]PIC JULIO 2020'!$A$2:$O$40,15,0)","v":3740},{"$f":"VLOOKUP(A5:A37,'[1]PIC JULIO 2020'!$A$2:$P$37,16,0)","v":4722},{"$f":"VLOOKUP(A5:A37,'[2]PIC JULIO 2020'!$A$2:$Q$40,17,0)","v":"2020-07-20"},"https://www.contratos.gov.co/consultas/detalleProceso.do?numConstancia=20-4-10938616"]
[22645320,"ADRIANA CRISTINA GARCIA CARRILLO","216-2020 -PIC","FISIOTERAPEUTA","01 julio de 2020","31 de Julio de 2020",2500000,2500000,"ANABELL VELASQUEZ","COORDINADORA PIC ","PIC",{"$f":"VLOOKUP(A6:A37,'[1]PIC JULIO 2020'!$A$2:$O$40,15,0)","v":3741},{"$f":"VLOOKUP(A6:A37,'[1]PIC JULIO 2020'!$A$2:$P$37,16,0)","v":4723},{"$f":"VLOOKUP(A6:A37,'[2]PIC JULIO 2020'!$A$2:$Q$40,17,0)","v":"2020-07-20"},"https://www.contratos.gov.co/consultas/detalleProceso.do?numConstancia=20-4-10938617"]
[32777087,"ROSA MARGARITA SEVILLA","217-2020 -PIC","NUTRICIONISTA ","01 julio de 2020","31 de Julio de 2020",2500000,2500000,"ANABELL VELASQUEZ","COORDINADORA PIC ","PIC",{"$f":"VLOOKUP(A7:A37,'[1]PIC JULIO 2020'!$A$2:$O$40,15,0)","v":3742},{"$f":"VLOOKUP(A7:A37,'[1]PIC JULIO 2020'!$A$2:$P$37,16,0)","v":4724},{"$f":"VLOOKUP(A7:A37,'[2]PIC JULIO 2020'!$A$2:$Q$40,17,0)","v":"2020-07-20"},"https://www.contratos.gov.co/consultas/detalleProceso.do?numConstancia=20-4-10938618"]
[1065575009,"ANDREA TATIANA SERRANO MOLINA ","218-2020 -PIC","PSICOLOGO ","01 julio de 2020","31 de Julio de 2020",2500000,2500000,"ANABELL VELASQUEZ","COORDINADORA PIC ","PIC",{"$f":"VLOOKUP(A8:A37,'[1]PIC JULIO 2020'!$A$2:$O$40,15,0)","v":3743},{"$f":"VLOOKUP(A8:A37,'[1]PIC JULIO 2020'!$A$2:$P$37,16,0)","v":4725},{"$f":"VLOOKUP(A8:A37,'[2]PIC JULIO 2020'!$A$2:$Q$40,17,0)","v":"2020-07-20"},"https://www.contratos.gov.co/consultas/detalleProceso.do?numConstancia=20-4-10938619"]
[22617307,"ETILVIA TERESA DONADO CABALLERO ","219-2020 -PIC","PSICOLOGO ","01 julio de 2020","31 de Julio de 2020",2500000,2500000,"ANABELL VELASQUEZ","COORDINADORA PIC ","PIC",{"$f":"VLOOKUP(A9:A37,'[1]PIC JULIO 2020'!$A$2:$O$40,15,0)","v":3744},{"$f":"VLOOKUP(A9:A37,'[1]PIC JULIO 2020'!$A$2:$P$37,16,0)","v":4726},{"$f":"VLOOKUP(A9:A37,'[2]PIC JULIO 2020'!$A$2:$Q$40,17,0)","v":"2020-07-20"},"https://www.contratos.gov.co/consultas/detalleProceso.do?numConstancia=20-4-10938620"]
[1140873504,"OLMAN JOSHUA BULA TORRES","220-2020 -PIC","PSICOLOGO ","01 julio de 2020","31 de Julio de 2020",2500000,2500000,"ANABELL VELASQUEZ","COORDINADORA PIC ","PIC",{"$f":"VLOOKUP(A10:A37,'[1]PIC JULIO 2020'!$A$2:$O$40,15,0)","v":3745},{"$f":"VLOOKUP(A10:A37,'[1]PIC JULIO 2020'!$A$2:$P$37,16,0)","v":4727},{"$f":"VLOOKUP(A10:A37,'[2]PIC JULIO 2020'!$A$2:$Q$40,17,0)","v":"2020-07-20"},"https://www.contratos.gov.co/consultas/detalleProceso.do?numConstancia=20-4-10938621"]
[1046872703,"LUCELIS DE LA HOZ ESCORCIA","221-2020 -PIC","AUXILIAR ADMINISTRATIVO-PIC","01 julio de 2020","31 de Julio de 2020",1900000,1900000,"ANABELL VELASQUEZ","COORDINADORA PIC ","PIC",{"$f":"VLOOKUP(A11:A37,'[1]PIC JULIO 2020'!$A$2:$O$40,15,0)","v":3746},{"$f":"VLOOKUP(A11:A37,'[1]PIC JULIO 2020'!$A$2:$P$37,16,0)","v":4728},{"$f":"VLOOKUP(A11:A37,'[2]PIC JULIO 2020'!$A$2:$Q$40,17,0)","v":"2020-07-20"},"https://www.contratos.gov.co/consultas/detalleProceso.do?numConstancia=20-4-10938623"]
[72429089,"EDER DE JESUS SEGURA BRAVO","222-2020 -PIC","HIGIENISTA ORAL","01 julio de 2020","31 de Julio de 2020",1900000,1900000,"ANABELL VELASQUEZ","COORDINADORA PIC ","PIC",{"$f":"VLOOKUP(A12:A37,'[1]PIC JULIO 2020'!$A$2:$O$40,15,0)","v":3747},{"$f":"VLOOKUP(A12:A37,'[1]PIC JULIO 2020'!$A$2:$P$37,16,0)","v":4729},{"$f":"VLOOKUP(A12:A37,'[2]PIC JULIO 2020'!$A$2:$Q$40,17,0)","v":"2020-07-20"},"https://www.contratos.gov.co/consultas/detalleProceso.do?numConstancia=20-4-10938624"]
[72271553,"DAVID ENRIQUE AGRESOT DE LA CRUZ","223-2020 -PIC","LIDER DE ZOONOSIS ","01 julio de 2020","31 de Julio de 2020",1900000,1900000,"ANABELL VELASQUEZ","COORDINADORA PIC ","PIC",{"$f":"VLOOKUP(A13:A37,'[1]PIC JULIO 2020'!$A$2:$O$40,15,0)","v":3748},{"$f":"VLOOKUP(A13:A37,'[1]PIC JULIO 2020'!$A$2:$P$37,16,0)","v":4730},{"$f":"VLOOKUP(A13:A37,'[2]PIC JULIO 2020'!$A$2:$Q$40,17,0)","v":"2020-07-20"},"https://www.contratos.gov.co/consultas/detalleProceso.do?numConstancia=20-4-10938625"]
[32876278,"CLAUDIA MARTINEZ RIVAS ","224-2020 -PIC","AGENTE PRIMARIA EN SALUD-APS","01 julio de 2020","31 de Julio de 2020",1400000,1400000,"ANABELL VELASQUEZ","COORDINADORA PIC ","PIC",{"$f":"VLOOKUP(A14:A37,'[1]PIC JULIO 2020'!$A$2:$O$40,15,0)","v":3749},{"$f":"VLOOKUP(A14:A37,'[1]PIC JULIO 2020'!$A$2:$P$37,16,0)","v":4731},{"$f":"VLOOKUP(A14:A37,'[2]PIC JULIO 2020'!$A$2:$Q$40,17,0)","v":"2020-07-20"},"https://www.contratos.gov.co/consultas/detalleProceso.do?numConstancia=20-4-10938627"]
[1143136225,"MARTA CECILIA MARIN ZAPATA","225-2020 -PIC","AGENTE PRIMARIA EN SALUD-APS","01 julio de 2020","31 de Julio de 2020",1400000,1400000,"ANABELL VELASQUEZ","COORDINADORA PIC ","PIC",{"$f":"VLOOKUP(A15:A37,'[1]PIC JULIO 2020'!$A$2:$O$40,15,0)","v":3750},{"$f":"VLOOKUP(A15:A37,'[1]PIC JULIO 2020'!$A$2:$P$37,16,0)","v":4732},{"$f":"VLOOKUP(A15:A37,'[2]PIC JULIO 2020'!$A$2:$Q$40,17,0)","v":"2020-07-20"},"https://www.contratos.gov.co/consultas/detalleProceso.do?numConstancia=20-4-10938629"]
[1043931882,"AREIDIS MEDINA SANJUAN ","226-2020 -PIC","AGENTE PRIMARIA EN SALUD-APS","01 julio de 2020","31 de Julio de 2020",1400000,1400000,"ANABELL VELASQUEZ","COORDINADORA PIC ","PIC",{"$f":"VLOOKUP(A16:A37,'[1]PIC JULIO 2020'!$A$2:$O$40,15,0)","v":3751},{"$f":"VLOOKUP(A16:A37,'[1]PIC JULIO 2020'!$A$2:$P$37,16,0)","v":4733},{"$f":"VLOOKUP(A16:A37,'[2]PIC JULIO 2020'!$A$2:$Q$40,17,0)","v":"2020-07-20"},"https://www.contratos.gov.co/consultas/detalleProceso.do?numConstancia=20-4-10938630"]
[22543666,"DENNYS MARIELA ARZUZAR GALVIS","227-2020 -PIC","AGENTE PRIMARIA EN SALUD-APS","01 julio de 2020","31 de Julio de 2020",1400000,1400000,"ANABELL VELASQUEZ","COORDINADORA PIC ","PIC",{"$f":"VLOOKUP(A17:A37,'[1]PIC JULIO 2020'!$A$2:$O$40,15,0)","v":3752},{"$f":"VLOOKUP(A17:A37,'[1]PIC JULIO 2020'!$A$2:$P$37,16,0)","v":4734},{"$f":"VLOOKUP(A17:A37,'[2]PIC JULIO 2020'!$A$2:$Q$40,17,0)","v":"2020-07-20"},"https://www.contratos.gov.co/consultas/detalleProceso.do?numConstancia=20-4-10938631"]
[44160070,"GLORIA ZAPATA REZA","228-2020 -PIC","AGENTE PRIMARIA EN SALUD-APS","01 julio de 2020","31 de Julio de 2020",1400000,1400000,"ANABELL VELASQUEZ","COORDINADORA PIC ","PIC",{"$f":"VLOOKUP(A18:A37,'[1]PIC JULIO 2020'!$A$2:$O$40,15,0)","v":3753},{"$f":"VLOOKUP(A18:A37,'[1]PIC JULIO 2020'!$A$2:$P$37,16,0)","v":4735},{"$f":"VLOOKUP(A18:A37,'[2]PIC JULIO 2020'!$A$2:$Q$40,17,0)","v":"2020-07-20"},"https://www.contratos.gov.co/consultas/detalleProceso.do?numConstancia=20-4-10938633"]
[44152281,"KAREN JOHANA JIMENEZ RAMOS","229-2020 -PIC","AGENTE PRIMARIA EN SALUD-APS","01 julio de 2020","31 de Julio de 2020",1400000,1400000,"ANABELL VELASQUEZ","COORDINADORA PIC ","PIC",{"$f":"VLOOKUP(A19:A37,'[1]PIC JULIO 2020'!$A$2:$O$40,15,0)","v":3754},{"$f":"VLOOKUP(A19:A37,'[1]PIC JULIO 2020'!$A$2:$P$37,16,0)","v":4736},{"$f":"VLOOKUP(A19:A37,'[2]PIC JULIO 2020'!$A$2:$Q$40,17,0)","v":"2020-07-20"},"https://www.contratos.gov.co/consultas/detalleProceso.do?numConstancia=20-4-10938634"]
[44150081,"MARY LUZ GUERRERO CERVANTES ","230-2020 -PIC","AGENTE PRIMARIA EN SALUD-APS","01 julio de 2020","31 de Julio de 2020",1400000,1400000,"ANABELL VELASQUEZ","COORDINADORA PIC ","PIC",{"$f":"VLOOKUP(A20:A37,'[1]PIC JULIO 2020'!$A$2:$O$40,15,0)","v":3755},{"$f":"VLOOKUP(A20:A37,'[1]PIC JULIO 2020'!$A$2:$P$37,16,0)","v":4737},{"$f":"VLOOKUP(A20:A37,'[2]PIC JULIO 2020'!$A$2:$Q$40,17,0)","v":"2020-07-20"},"https://www.contratos.gov.co/consultas/detalleProceso.do?numConstancia=20-4-10938635"]
[1002162856,"NICOLL PATRICIA NIEBLES RIVERA","231-2020 -PIC","AGENTE PRIMARIA EN SALUD-APS","01 julio de 2020","31 de Julio de 2020",1400000,1400000,"ANABELL VELASQUEZ","COORDINADORA PIC ","PIC",{"$f":"VLOOKUP(A21:A37,'[1]PIC JULIO 2020'!$A$2:$O$40,15,0)","v":3756},{"$f":"VLOOKUP(A21:A37,'[1]PIC JULIO 2020'!$A$2:$P$37,16,0)","v":4738},{"$f":"VLOOKUP(A21:A37,'[2]PIC JULIO 2020'!$A$2:$Q$40,17,0)","v":"2020-07-20"},"https://www.contratos.gov.co/consultas/detalleProceso.do?numConstancia=20-4-10938636"]
[32758730,"NUBIA ESTELA CANO GUILLEN","232-2020 -PIC","AGENTE PRIMARIA EN SALUD-APS","01 julio de 2020","31 de Julio de 2020",1400000,1400000,"ANABELL VELASQUEZ","COORDINADORA PIC ","PIC",{"$f":"VLOOKUP(A22:A37,'[1]PIC JULIO 2020'!$A$2:$O$40,15,0)","v":3757},{"$f":"VLOOKUP(A22:A37,'[1]PIC JULIO 2020'!$A$2:$P$37,16,0)","v":4739},{"$f":"VLOOKUP(A22:A37,'[2]PIC JULIO 2020'!$A$2:$Q$40,17,0)","v":"2020-07-20"},"https://www.contratos.gov.co/consultas/detalleProceso.do?numConstancia=20-4-10938638"]
[1042449446,"SAILIS MARIA FRIA VEGA","233-2020 -PIC","AGENTE PRIMARIA EN SALUD-APS","01 julio de 2020","31 de Julio de 2020",1400000,1400000,"ANABELL VELASQUEZ","COORDINADORA PIC ","PIC",{"$f":"VLOOKUP(A23:A37,'[1]PIC JULIO 2020'!$A$2:$O$40,15,0)","v":3758},{"$f":"VLOOKUP(A23:A37,'[1]PIC JULIO 2020'!$A$2:$P$37,16,0)","v":4740},{"$f":"VLOOKUP(A23:A37,'[2]PIC JULIO 2020'!$A$2:$Q$40,17,0)","v":"2020-07-20"},"https://www.contratos.gov.co/consultas/detalleProceso.do?numConstancia=20-4-10938639"]
[1047337919,"CANDY ISABEL ROJAS SARMIENTO","234-2020 -PIC","AGENTE PRIMARIA EN SALUD-ZOONOSIS","01 julio de 2020","31 de Julio de 2020",1400000,1400000,"ANABELL VELASQUEZ","COORDINADORA PIC ","PIC",{"$f":"VLOOKUP(A24:A37,'[1]PIC JULIO 2020'!$A$2:$O$40,15,0)","v":3759},{"$f":"VLOOKUP(A24:A37,'[1]PIC JULIO 2020'!$A$2:$P$37,16,0)","v":4741},{"$f":"VLOOKUP(A24:A37,'[2]PIC JULIO 2020'!$A$2:$Q$40,17,0)","v":"2020-07-20"},"https://www.contratos.gov.co/consultas/detalleProceso.do?numConstancia=20-4-10938640"]
[8784783,"DAIRO MANRIQUEZ MORALES BOVEA","235-2020 -PIC","AGENTE PRIMARIA EN SALUD-ZOONOSIS","01 julio de 2020","31 de Julio de 2020",1400000,1400000,"ANABELL VELASQUEZ","COORDINADORA PIC ","PIC",{"$f":"VLOOKUP(A25:A37,'[1]PIC JULIO 2020'!$A$2:$O$40,15,0)","v":3760},{"$f":"VLOOKUP(A25:A37,'[1]PIC JULIO 2020'!$A$2:$P$37,16,0)","v":4742},{"$f":"VLOOKUP(A25:A37,'[2]PIC JULIO 2020'!$A$2:$Q$40,17,0)","v":"2020-07-20"},"https://www.contratos.gov.co/consultas/detalleProceso.do?numConstancia=20-4-10938641"]
[32829868,"JUDITH ISABEL ARCON MEDINA","236-2020 -PIC","AGENTE PRIMARIA EN SALUD-ZOONOSIS","01 julio de 2020","31 de Julio de 2020",1400000,1400000,"ANABELL VELASQUEZ","COORDINADORA PIC ","PIC",{"$f":"VLOOKUP(A26:A37,'[1]PIC JULIO 2020'!$A$2:$O$40,15,0)","v":3761},{"$f":"VLOOKUP(A26:A37,'[1]PIC JULIO 2020'!$A$2:$P$37,16,0)","v":4743},{"$f":"VLOOKUP(A26:A37,'[2]PIC JULIO 2020'!$A$2:$Q$40,17,0)","v":"2020-07-20"},"https://www.contratos.gov.co/consultas/detalleProceso.do?numConstancia=20-4-10938642"]
[1046698080,"LUIS ALFREDO CANTILLO CABALLERO","237-2020 -PIC","AGENTE PRIMARIA EN SALUD-ZOONOSIS","01 julio de 2020","31 de Julio de 2020",1400000,1400000,"ANABELL VELASQUEZ","COORDINADORA PIC ","PIC",{"$f":"VLOOKUP(A27:A37,'[1]PIC JULIO 2020'!$A$2:$O$40,15,0)","v":3762},{"$f":"VLOOKUP(A27:A37,'[1]PIC JULIO 2020'!$A$2:$P$37,16,0)","v":4744},{"$f":"VLOOKUP(A27:A37,'[2]PIC JULIO 2020'!$A$2:$Q$40,17,0)","v":"2020-07-20"},"https://www.contratos.gov.co/consultas/detalleProceso.do?numConstancia=20-4-10938643"]
[30895455,"MARIA CONCEPCION ESPRIELLA BUELVAS","239-2020 -PIC","AGENTE PRIMARIA EN SALUD-ZOONOSIS","01 julio de 2020","31 de Julio de 2020",1400000,1400000,"ANABELL VELASQUEZ","COORDINADORA PIC ","PIC",{"$f":"VLOOKUP(A28:A37,'[1]PIC JULIO 2020'!$A$2:$O$40,15,0)","v":3764},{"$f":"VLOOKUP(A28:A37,'[1]PIC JULIO 2020'!$A$2:$P$37,16,0)","v":4746},{"$f":"VLOOKUP(A28:A37,'[2]PIC JULIO 2020'!$A$2:$Q$40,17,0)","v":"2020-07-20"},"https://www.contratos.gov.co/consultas/detalleProceso.do?numConstancia=20-4-10938647"]
[1143442239,"SAYURIS OCAMPO GARCIA","240-2020 -PIC","AGENTE PRIMARIA EN SALUD-ZOONOSIS","01 julio de 2020","31 de Julio de 2020",1400000,1400000,"ANABELL VELASQUEZ","COORDINADORA PIC ","PIC",{"$f":"VLOOKUP(A29:A37,'[1]PIC JULIO 2020'!$A$2:$O$40,15,0)","v":3765},{"$f":"VLOOKUP(A29:A37,'[1]PIC JULIO 2020'!$A$2:$P$37,16,0)","v":4747},{"$f":"VLOOKUP(A29:A37,'[2]PIC JULIO 2020'!$A$2:$Q$40,17,0)","v":"2020-07-20"},"https://www.contratos.gov.co/consultas/detalleProceso.do?numConstancia=20-4-10938648"]
[32872420,"LUZ MARINA GARIZAO TAPIA","241-2020 -PIC","AGENTE PRIMARIA EN SALUD-ZOONOSIS","01 julio de 2020","31 de Julio de 2020",1400000,1400000,"ANABELL VELASQUEZ","COORDINADORA PIC ","PIC",{"$f":"VLOOKUP(A30:A37,'[1]PIC JULIO 2020'!$A$2:$O$40,15,0)","v":3766},{"$f":"VLOOKUP(A30:A37,'[1]PIC JULIO 2020'!$A$2:$P$37,16,0)","v":4748},{"$f":"VLOOKUP(A30:A37,'[2]PIC JULIO 2020'!$A$2:$Q$40,17,0)","v":"2020-07-20"},"https://www.contratos.gov.co/consultas/detalleProceso.do?numConstancia=20-4-10938649"]
{"$rows_left_out":7}