{"text_format":"1","workbook":"xlsx","n_sheets":2,"sheets":["OPS ","PLANTA DE PERSONAL"],"not_rendered":{"charts":0,"images":0,"macros":1,"external_links":1,"defined_names":4,"comments":1,"pivot_tables":0},"unopened":[],"bounds":{"document_bytes":16777216,"sheet_cells":100000,"rows_first":2000,"rows_last":500,"rows_between":2000,"halvings":0,"cell_chars":16384,"cell_head_chars":4096},"cells_cut":0,"cells_raw":0,"read":"whole","date_system":"1900"}

{"sheet":"OPS ","index":0,"n_rows":506,"n_cols":18,"rows_kept":506,"cut":false,"hidden":false,"merged":[]}
["No","CEDULA","NOMBRES APELLIDOS CONTRATISTA","PAIS DE NACIMIENTO","DEPARTAMENTO DE NACIMIENTO","CIUDAD DE NACIMIENTO ","FORMACION ACADEMICA ","OBJETO DEL CONTRATO","FECHA INICIO","FECHA TERMINACION ","VALOR MENSUAL","VALOR TOTAL ","DEPENDENCIA DONDE PRESTA LOS SERVICIOS EN LA ENTIDAD ","SERVICIO","TIPO DE CONTRATO ","CORREO ","TELEFONO ","AÑOS DE EXPERIENCIA"]
[1,55309225,"ADRIANA BALLESTAS MARTINEZ","Colombia","Atlántico","BARRANQUILLA","MEDICINA","MEDICO DE URGENCIAS","03 de Noviembre de 2020 ","30 de Noviembre de 2020 ",3072000,3072000,"CENTRO DE SALUD 13 DE JUNIO","Asistencial","PRESTACION DE SERVICIO","adriana_ballestas@hotmail.com","3042592",3]
[{"$f":"+A2+1","v":2},1103109488,"ADRIANA MARCELA CASTAÑO RODELO ","Colombia","Atlántico","MAJAGUAL","MEDICINA","MEDICO PROGRAMA CARDIOVASCULAR","03 de Noviembre de 2020 ","30 de Noviembre de 2020 ",2300000,2300000,"CENTRO DE SALUD  SALAMANCA","Asistencial","PRESTACION DE SERVICIO","adria0319@hotmail.com","3023238162",2]
[{"$f":"+A3+1","v":3},22465848,"ADRIANA OROZCO CANTILLO","Colombia","Atlántico","BARRANQUILLA","BACHILLER ACADEMICO ","PERSONAL  LIMPIEZA Y ASEO","03 de Noviembre de 2020 ","30 de Noviembre de 2020 ",1215000,1215000,"CENTRO DE SALUD  MACLOVIA","Administrativo","PRESTACION DE SERVICIO","adesorozcocantillo@hotmail.com","3005063640",5]
[4,1140895535,"ADRIANA PAOLA GONZALEZ ROMERO ","Colombia","Atlántico","BARRANQUILLA","ENFERMERIA","ENFERMERA JEFE CONSULTA EXTERNA ","03 de Noviembre de 2020 ","30 de Noviembre de 2020 ",2120000,2120000,"CENTRO DE SALUD LA ESPERANZA","Asistencial","PRESTACION DE SERVICIO","adriana_gonzalez97@outlook.es","3017466458",2]
[5,55236945,"ADRIANA PATRICIA MARQUEZ CANTILLO","Colombia","Atlántico","VALLEDUPAR","TECNICA PROFESIONAL EN AUXILIAR DE ENFERMERIA","VACUNADOR(A)","03 de Noviembre de 2020 ","30 de Noviembre de 2020 ",1400000,1400000,"CENTRO VACUNACION  MANUELA BELTRAN","Asistencial","PRESTACION DE SERVICIO","adrianav0927@hotmail.com","3727379",3]
[6,1042451687,"ADRIANA SOFIA PEREZ CERVANTES","Colombia","Atlántico","SOLEDAD","TECNICA PROFESIONAL EN ARCHIVISTICA","AGENTE CALL CENTER","03 de Noviembre de 2020 ","30 de Noviembre de 2020 ",1378000,1378000,"CALL CENTER -CIUDADELA ","Administrativo","PRESTACION DE SERVICIO","adrisofi1231@gmail.com","3135288336",3]
[7,39059528,"ALBA CEVEDDA SERNA MEJIA ","Colombia","Magdalena","CIÉNAGA","TECNICA PROFESIONAL EN AUXILIAR DE ENFERMERIA","AUXILIAR DE ENFERMERIA URGENCIAS","03 de Noviembre de 2020 ","30 de Noviembre de 2020 ",1653600,1653600,"CENTRO DE  SALUD CIUDADELA METROPOLITANA","Asistencial","PRESTACION DE SERVICIO","albithaserna21@hotmail.com","3003412712",5]
[8,1143437950,"ALBA KARINA  ARIAS  ESCOBAR ","Colombia","Atlántico","BARRANQUILLA","MEDICINA","MEDICO CONSULTA EXTERNA","03 de Noviembre de 2020 ","30 de Noviembre de 2020 ",2120000,2120000,"CENTRO DE SALUD MANUELA BELTRAN ","Asistencial","PRESTACION DE SERVICIO","karina-arias2012@hotmail.com","3727622",4]
[9,1045166274,"ALBA MARINA RODRIGUEZ YANCE","Colombia","Atlántico","BARRANQUILLA","ODONTOLOGIA","ASESORA SALUD PUBLICA EN LA SUBGERENCIA CIENTIFICA - COVID19","03 de Noviembre de 2020 ","30 de Noviembre de 2020 ",5800000,5800000,"OFICINA ADMINISTRATIVA SUBGERENCIA CIENTIFICA -  COSTA HERMOSA","Administrativo","PRESTACION DE SERVICIO","ayance4@hotmail.com",{"$f":"VLOOKUP(C10:C504,[1]OPS!$A$3:$C$492,3,0)","v":3002620238},5]
[10,1140874429,"ALBERTO DE LA OSSA DE AVILA","Colombia","Atlántico","SOLEDAD","ECONOMIA","PROFESIONAL  PRESUPUESTO ","03 de Noviembre de 2020 ","30 de Noviembre de 2020 ",3500000,3500000,"FINANCIERA -ADMON  COSTA HERMOSA","Administrativo","PRESTACION DE SERVICIO","amdelaossa94@gmail.com","3815185",3]
[11,8505956,"ALBERTO NAVARRO MORALES","Colombia","Atlántico","BARRANQUILLA","CONTADURIA PUBLICA","AUXILIAR FACTURACION URGENCIAS","03 de Noviembre de 2020 ","30 de Noviembre de 2020 ",1680000,1680000,"CENTRO DE  SALUD CIUDADELA METROPOLITANA","Administrativo","PRESTACION DE SERVICIO","alberton-728@hotmail.com","3326004",3]
[12,64543985,"ALCIRA GOMEZ ARRIETA ","Colombia","Sucre","COROZAL","ENFERMERIA"," COORDINADORA PAI ","03 de Noviembre de 2020 ","30 de Noviembre de 2020 ",4000000,4000000,"CENTRO VACUNACION  MANUELA BELTRAN","Administrativo","PRESTACION DE SERVICIO","alciragomezarrieta@hotmail.com","3007901179",12]
[13,8566775,"ALEJANDRO LIBARDO ALEMAN MARQUEZ","Colombia","Atlántico","SOLEDAD","TECNICO","AUXILIAR DE ARCHIVO ","03 de Noviembre de 2020 ","30 de Noviembre de 2020 ",1500000,1500000,"ARCHIVO CENTRAL","Administrativo","PRESTACION DE SERVICIO","alejandroalemanm@hotmail.com","3005620188 ",6]
[14,1042428171,"ALEX ENRIQUE VILLARREAL IBAÑEZ","Colombia","Atlántico","BARRANQUILLA","ODONTOLOGIA","ODONTOLOGO","03 de Noviembre de 2020 ","30 de Noviembre de 2020 ",1900000,1900000,"CENTRO DE SALUD 13 DE JUNIO","Asistencial","PRESTACION DE SERVICIO","dr.alex.villarreal.i@gmail.com","3926281",6]
[15,22523223,"ALEXANDRA ESTHER MOLINA PEREZ","Colombia","Atlántico","BARRANQUILLA","BACHILLER ACADEMICO ","PERSONAL  LIMPIEZA Y ASEO URGENCIA","03 de Noviembre de 2020 ","30 de Noviembre de 2020 ",1653600,1653600,"CENTRO DE SALUD 13 DE JUNIO","Administrativo","PRESTACION DE SERVICIO","alexandramolina592@gmail.com","3128199503",8]
[16,72000601,"ALEXIS JAVIER SUAREZ CABALLERO","Colombia","Atlántico","BARRANQUILLA","BACHILLER ACADEMICO ","AUXILIAR FACTURACION URGENCIAS","03 de Noviembre de 2020 ","30 de Noviembre de 2020 ",1680000,1680000,"CENTRO DE SALUD 13 DE JUNIO","Administrativo","PRESTACION DE SERVICIO","alesuca77@hotmail.com","3003479650",10]
[17,15666678,"ALFREDO ANTONIO RAMIREZ PEREIRA","Colombia","Atlántico","SOLEDAD","TECNICO","LIDER ARCHIVO  CENTRAL","03 de Noviembre de 2020 ","30 de Noviembre de 2020 ",3000000,3000000,"ARCHIVO CENTRAL","Administrativo","PRESTACION DE SERVICIO","planetero1103@hotmail.com",{"$f":"VLOOKUP(C18:C505,[1]OPS!$A$3:$C$492,3,0)","v":3003885293},12]
[18,72212724,"ALFREDO DE JESUS SIERRA BARRIOS","Colombia","Atlántico","BARRANQUILLA","INGENIERIA INDUSTRIAL","AUXILIAR FACTURACION","03 de Noviembre de 2020 ","30 de Noviembre de 2020 ",1400000,1400000,"CENTRO DE SALUD  EL PARQUE","Administrativo","PRESTACION DE SERVICIO","alfredsierra@hotmail.com","3844532",3]
[19,8721508,"ALONSO JOSÉ RIQUETT DE LA HOZ","Colombia","Atlántico","BARRANQUILLA","MEDICINA","MEDICO DE PROMOCIÓN Y MANTENIMIENTO DE LA SALUD","03 de Noviembre de 2020 ","30 de Noviembre de 2020 ",2120000,2120000,"CENTRO DE SALUD  COSTA HERMOSA","Asistencial","PRESTACION DE SERVICIO","alonsoriquett@hotmail.com","3575393",11]
[20,1139614174,"ALONSO MATEO LLANES ARIZA","Colombia","Atlántico","SANTO TOMAS","MEDICINA","MEDICO CONSULTA EXTERNA ","03 de Noviembre de 2020 ","30 de Noviembre de 2020 ",2120000,2120000,"CENTRO DE SALUD LA ESPERANZA","Asistencial","PRESTACION DE SERVICIO","mateollanes_2431@hotmail.com",{"$f":"VLOOKUP(C21:C508,[1]OPS!$A$3:$C$492,3,0)","v":3002552869},8]
[21,8697543,"ALVARO ARENAS GONZALEZ","Colombia","Atlántico","BARRANQUILLA","MEDICINA","MEDICO DE RUTA INTEGRAL MATERNO PERINATAL ","03 de Noviembre de 2020 ","30 de Noviembre de 2020 ",5088000,5088000,"CENTRO DE SALUD 13 DE JUNIO","Asistencial","PRESTACION DE SERVICIO","a_arenasg@hotmail.com","3012113981",11]
[22,8680252,"ALVARO SAMUEL PULGAR LEMUS","Colombia","Atlántico","BARRANQUILLA","BACHILLER ACADEMICO ","ORIENTADOR","03 de Noviembre de 2020 ","30 de Noviembre de 2020 ",1270000,1270000,"ADMIISTRATIVA-  COSTA HERMOSA","Administrativo","PRESTACION DE SERVICIO","piedadpulgar@live.com","3002905490",6]
[23,1047338042,"AMINTA PARDO GUZMAN","Colombia","Atlántico","SOLEDAD","TECNICA PROFESIONAL EN AUXILIAR DE ENFERMERIA","AUXILIAR DE ENFERMERIA CONSULTA EXTERNA  ","03 de Noviembre de 2020 ","30 de Noviembre de 2020 ",1166000,1166000,"CENTRO DE SALUD  SALAMANCA","Asistencial","PRESTACION DE SERVICIO","amypardoguzman@gmail.com","3042916335",2]
[24,1045688469,"AMY MOVILLA COMAS","Colombia","Atlántico","BARRANQUILLA","ENFERMERIA","ENFERMERA JEFE CONSULTA EXTERNA  Y PROGRAMA DE  RIESGO CARDIOVASCULAR","03 de Noviembre de 2020 ","30 de Noviembre de 2020 ",2300000,2300000,"CENTRO DE SALUD  SALAMANCA","Asistencial","PRESTACION DE SERVICIO","banda251224@hotmail.com","3004080237",5]
[25,32813366,"ANA GONZALEZ ZAMBRANO","Colombia","Atlántico","SOLEDAD","TECNICO","AUXILIAR DE ARCHIVO ","03 de Noviembre de 2020 ","30 de Noviembre de 2020 ",2000000,2000000,"ARCHIVO CENTRAL","Administrativo","PRESTACION DE SERVICIO","cegon1825@hotmail.com","3104741637",12]
[26,1043671104,"ANA MILENA  GAMARRA HERRERA","Colombia","Atlántico","BARRANQUILLA","TECNICO","AUXILIAR SERVICIOS  FARMACEUTICOS ","03 de Noviembre de 2020 ","30 de Noviembre de 2020 ",1524000,1524000,"FARMACIA CENTRAL  COSTA HERMOSA","Asistencial","PRESTACION DE SERVICIO","milenagamarra0418@gmail.com","3015202619",4]
[27,1045704276,"ANA MILENA HERRERA ALVIS ","Colombia","Atlántico","BARRANQUILLA","ENFERMERIA","ENFERMERA JEFE DE PROMOCIÓN Y MANTENIMIENTO DE LA SALUD- EMERGENCIA COVID19","03 de Noviembre de 2020 ","30 de Noviembre de 2020 ",3810000,3810000,"CENTRO DE SALUD  COSTA HERMOSA","Asistencial","PRESTACION DE SERVICIO","anymile90@hotmail.com","3017397849",7]
[28,32825462,"ANAIS DE JESUS RODRIGUEZ DE  LAS AGUAS","Colombia","Atlántico","SOLEDAD","BASICA PRIMARIA ","PERSONAL  LIMPIEZA Y ASEO","03 de Noviembre de 2020 ","30 de Noviembre de 2020 ",1215000,1215000,"CENTRO DE SALUD  COSTA HERMOSA","Administrativo","PRESTACION DE SERVICIO","anaisdejesusrodriguez274@gmail.com","3022293663",4]
[29,1001893516,"ANDREA ALEJANDRA CERVANTES CORNIN","Colombia","Atlántico","SOLEDAD","TECNICO","AUXILIAR DE ARCHIVO ","03 de Noviembre de 2020 ","30 de Noviembre de 2020 ",1900000,1900000,"ARCHIVO CENTRAL","Administrativo","PRESTACION DE SERVICIO","corninmia@gmail.com",{"$f":"VLOOKUP(C30:C517,[1]OPS!$A$3:$C$492,3,0)","v":3106300547},2]
[30,1045706259,"ANDREA CAROLINA HERRERA ORTEGA","Colombia","Atlántico","BARRANQUILLA","MEDICINA","MEDICO CONSULTA EXTERNA ","03 de Noviembre de 2020 ","30 de Noviembre de 2020 ",2120000,2120000,"CENTRO DE SALUD VILLA ESTADIO","Asistencial","PRESTACION DE SERVICIO","andre_herrera@hotmail.com",{"$f":"VLOOKUP(C31:C518,[1]OPS!$A$3:$C$492,3,0)","v":3007438123},9]
[31,72303740,"ANDRES JOSE NAVARRO CARBONELL","Colombia","Bogotá D.C","BOGOTÁ","ADMINISTRACION DE EMPRESAS","AUXILIAR  ADMINISTRATIVO  DE FARMACIA ","03 de Noviembre de 2020 ","30 de Noviembre de 2020 ",3000000,3000000,"FARMACIA CENTRAL  COSTA HERMOSA","Asistencial","PRESTACION DE SERVICIO","andresnavarro79@hotmail.com","3007604623",5]
[32,32771752,"ANETHS CECILIA ARGOTE TORRES","Colombia","Atlántico","SOLEDAD","TECNICA PROFESIONAL EN SECRETARIADO","AGENTE CALL CENTER","03 de Noviembre de 2020 ","30 de Noviembre de 2020 ",1378000,1378000,"CALL CENTER -CIUDADELA ","Administrativo","PRESTACION DE SERVICIO","ane_argot@hotmail.com","301 5144330",5]
[33,1001821798,"ANGELA JUDITH BARRIOS MEJIA","Colombia","Atlántico","BARRANQUILLA","ENFERMERIA","AUXILIAR DE ENFERMERIA URGENCIAS","03 de Noviembre de 2020 ","30 de Noviembre de 2020 ",1653600,1653600,"CENTRO DE  SALUD CIUDADELA METROPOLITANA","Asistencial","PRESTACION DE SERVICIO",{"$f":"VLOOKUP(C34:C500,[1]OPS!$A$3:$B$493,2,0)","v":"angelajbarriosm@gmail.com"},{"$f":"VLOOKUP(C34:C504,[1]OPS!$A$3:$C$502,3,0)","v":3116422164},3]
[34,1006745656,"ANGIE FERNANDA BELEÑO RIVERO","Colombia","Atlántico","MAICAO","MEDICINA","MEDICO DE URGENCIAS","03 de Noviembre de 2020 ","30 de Noviembre de 2020 ",3072000,3072000,"CENTRO DE  SALUD CIUDADELA METROPOLITANA","Asistencial","PRESTACION DE SERVICIO","a_giefer@hotmail.com","3013438575",2]
[35,22736159,"ARACELLY HERNANDEZ GARCIA ","Colombia","Atlántico","BARRANQUILLA","TECNICO EN GESTION AMBIENTAL EMPRESARIAL","AUXILIAR ADMINISTRATIVO TIC  Y SISTEMA DE INFORMACION","03 de Noviembre de 2020 ","30 de Noviembre de 2020 ",2500000,2500000,"OFICINA  TIC- ADMON  COSTA HERMOSA","Administrativo","PRESTACION DE SERVICIO","araisahernandez@hotmail.com",{"$f":"VLOOKUP(C36:C523,[1]OPS!$A$3:$C$492,3,0)","v":3045538302},4]
[36,32869290,"ARGENEDITH YEPEZ ESCALANTE ","Colombia","Atlántico","BARRANQUILLA","BACHILLER ACADEMICO ","MEDICO DE PROMOCIÓN Y MANTENIMIENTO DE LA SALUD","03 de Noviembre de 2020 ","30 de Noviembre de 2020 ",2120000,2120000,"CENTRO DE SALUD MANUELA BELTRAN ","Asistencial","PRESTACION DE SERVICIO","ladoct79@hotmail.com","3005078179",9]
[37,22741244,"ARLETH PATRICIA CARRILLO GARVIN","Colombia","Atlántico","BARRANQUILLA","TECNICO","ENFERMERA JEFE CNSULTA EXTERNA ","03 de Noviembre de 2020 ","30 de Noviembre de 2020 ",2300000,2300000,"CENTRO DE SALUD 13 DE JUNIO","Asistencial","PRESTACION DE SERVICIO","arleth_patri@hotmail.com","3007524877",1]
[38,1001881009,"ARMANDO JOSE JINETE BARRIOS","Colombia","Atlántico","SOLEDAD","TECNICO","AUXILIAR DE ARCHIVO ","03 de Noviembre de 2020 ","30 de Noviembre de 2020 ",1500000,1500000,"ARCHIVO CENTRAL","Administrativo","PRESTACION DE SERVICIO","armando.jinete@unisimon.edu.co","3004069002",5]
[39,8501206,"AUGUSTO RAFAEL VALENCIA OCAMPO","Colombia","Atlántico","MANATI","TECNICO","AUXILIAR FACTURACION URGENCIAS","03 de Noviembre de 2020 ","30 de Noviembre de 2020 ",1680000,1680000,"CENTRO DE SALUD 13 DE JUNIO","Administrativo","PRESTACION DE SERVICIO",{"$f":"VLOOKUP(C40:C504,[1]OPS!$A$3:$B$493,2,0)","v":"josimar.guette23@gmail.com"},{"$f":"VLOOKUP(C40:C504,[1]OPS!$A$3:$C$502,3,0)","v":3505099302},12]
{"$rows_left_out":467}
{"sheet":"PLANTA DE PERSONAL","index":1,"n_rows":67,"n_cols":10,"rows_kept":67,"cut":false,"hidden":false,"merged":[]}
[" NOMBRE DEL EMPLEADO ","CORREO","TELEFONO","CIUDAD/MUNICIPIO","DENOMINACION "," Titulo Profesional"," Titulo Tecnico","SALARIO BASE","CENTRO","AÑOS DE EXPERIENCIA"]
["ALTAMAR BARRAZA JORGE LUIS","george_luis_1512@hotmail.com,","318 7024044","MALAMBO","Auxiliar Administrativo","ND","CONTABILIDAD",1993342,"VILLA ESTADIO",10]
["ANGULO SALCEDO KELLY BEATRIZ","kellyangulo1983@hotmail.com,","301 5930293","SOLEDAD","Auxiliar Administrativo","PSICOLOGA","AUXILIAR DE ARCHIVO, TECNICO PROFESIONAL EN RECURSOS HUMANOS",1993342,"VILLA ESTADIO",13]
[" ARIZA MARQUEZ NILSA MARIA ","jeynas-28@hotmail.com,","300 2767278","BARRANQUILLA"," Enfermero Especialista ","ENFERMERA","ND",6411891,"COSTA HERMOSA",15]
[" ARRIETA MEZA CESAR DAVID ","c_david-arrieta@hotmail.com,","302 2172234","BARRANQUILLA"," MEDICO ESPECIALISTA ","MEDICO CIRUJANO","ND",6411891,"COSTA HERMOSA",1]
["BOLIVAR GOMEZ AIDA LUZ","aida.bolivar@hotmail.com,","313 3214078","SOLEDAD","Auxiliar Administrativo","ND","ND",1993342,"13 DE JUNIO",13]
[" BOVEA MARIN SERGIO NICOLAS ","sergionicolas54@hotmail.com,","300 4334577","SOLEDAD"," Medico Especialista  ","MEDICO CIRUJANO","ND",6411891,"13 DE JUNIO",14]
["BUSTILLO PRETELL JUDITH ISABEL","judithbustillo_gordita24@hotmail.com,","300 3087961","BARRANQUILLA","Auxiliar Administrativo","ND","OPERACIÓN DE COMPUTADORES",1993342,"SALAMANCA",19]
["CALVO QUIROZ FREDY ENRIQUE","frecal01@hotmail.com,fredyscalvo58@hotmail.com","301 3339211","BARRANQUILLA","Auxiliar Administrativo","ND","ND",1993342,"SALAMANCA",19]
["CAMPO RODRIGUEZ LUXORA IBETH","luxora campo rodriguez<luxanti@hotmail.com>,","301 6257311","SOLEDAD"," Profesional Universitario ","CONTADOR PUBLICO","ANALISIS Y PROGRAMACION DE COMPUTADORES",5537440,"COSTA HERMOSA",13]
[" CANO MONTOYA ROQUELINA DE JESUS ","roquelinacanomontoya@hotmail.com,","301 2690099","SOLEDAD"," Axiliar Area de la Salud ","ND","AUXILIAR DE ENFERMERIA",2305314,"SALAMANCA",17]
["CASTELAR VELASQUEZ MALKIS ELENA","malkiscastelar@gmail.com,","300 5354513","BARRANQUILLA"," Medico General ","MEDICO CIRUJANO","ND",5125511,"CIUDADELA",10]
["CASTRO ROLONG ALFREDO JOSE","alfredojosecastrorolong39@gmail.com,","304 6156575","SOLEDAD"," Conductor ","ND","ND",1993342,"13 DE JUNIO",14]
["CERVANTES ARIZA WENDY JOHANA","wendycervante11@hotmail.com,","312 6724893","SOLEDAD"," Tecnico Administrativo ","ND","PROFESIONAL EN ADMINISTRACION DE RECURSOS HUMANOS, SECRETARIA GENERAL",3104561,"COSTA HERMOSA",9]
[" CERVANTES MARQUEZ LILIANA DE LA CRUZ ","licemarquez01@hotmail.com,","301 2879881","SABANALARGA"," Secretaria de Gerencia ","ND","SECRETARIA GENERAL",2335679,"COSTA HERMOSA",1]
[" COLPAS OROZCO FABIAN ENRIQUE ","fecolo@hotmail.es,","313 5770114","PONEDERA","Jefe de Oficina","ABOGADO","ND",6545535,"COSTA HERMOSA",1]
[" DE LA HOZ ROLON ALFONSO MIGUEL ","ALFONSOMDELAHOZ-1000@HOTMAIL.COM,","300 7695334","SOLEDAD"," Medico General ","MEDICO CIRUJANO","ND",5125511,"13 DE JUNIO",17]
[" DE LEON BERNIER LUIS CARLOS ","luiscdeleonb@hotmail.com,","300 6623595","BARRANQUILLA"," Profesional Universitario Area Salud ","MEDICO CIRUJANO","ND",5956368,"MACLOVIA",12]
["DE MOYA BADILLO LUIS ENRIQUE","luisdemoyab@gmail.com,","300 7898394","GALAPA"," Tesorero General ","ADMINISTRADOR DE EMPRESAS","ND",5537440,"COSTA HERMOSA",1]
[" DIAZ ALVAREZ IRAIDA MARIA ","iraida diaz<diaziraida24@gmail.com>,","300 6198717","SOLEDAD"," AUxiliar Area de la Salud ","ND","AUXILIAR DE ENFERMERIA",2305314,"MACLOVIA",1]
[" DONADO MARTINEZ ASTRID DEL SOCORRO ","astrydonado@hotmail.com,","300 5869374","Cra 26A# 17-56"," Odontologo Especialista ","ODONTOLOGA","ND",5956368,"COSTA HERMOSA",13]
[" ESCORCIA RODRIGUEZ ISABEL CECILIA ","isabelescorcia1979@hotmail.com,","300 8081108","SOLEDAD"," Enfermero ","ENFERMERA","ND",3832264,"COSTA HERMOSA",13]
[" FIORENTINO CASADIEGO ORNELLA ","ornefioren@hotmail.com,","300 3961602","BARRANQUILLA"," Jefe de Oficina Asesora ","ABOGADO","ND",6545535,"COSTA HERMOSA",1]
[" GOENAGA ZAPATA HUMBERTO JULIO ","humbergoen@hotmail.com,","301 4029009","BARANOA"," Tecnico Operativo ","CONTADOR PUBLICO","ND",3104561,"COSTA HERMOSA",9]
[" GOMEZ VILLA MARIA ANTONIA  ","medicomagovi@hotmail.com,","301 5270994","SOLEDAD"," Medico General ","MEDICO CIRUJANO","ND",5125511,"CIUDADELA",17]
[" GRANADOS  GOMEZ LUIS ANTONIO ","drluisgranados@hotmail.com,","301 7833998","BARRANQUILLA"," Medico Especialista  ","MEDICO CIRUJANO","ND",5956368,"MANUELA BELTRAN",16]
["GRAVINI ESCORCIA YEISMI JAIR","yeismigravini@hotmail.com,","320 5767205","SOLEDAD","Auxiliar Administrativo","COMUNICADOR SOCIAL","TECNICO EN ANALISIS Y PROGRAMACION DE COMPUTADORES",1993342,"13 DE JUNIO",13]
["GUERRA CORREA YARELIS","yareguerra@hotmail.com,","301 3983960","BARRANQUILLA"," Medico Especialista  ","MEDICO CIRUJANO","ND",5956368,"VILLA ESTADIO",12]
["GUTIERREZ DE PIÑERES BARVO GENARO","ggutierrezdep@outlook.com,","301 6013007","BARRANQUILLA","Jefe de Oficina","ADMINISTRADOR DE EMPRESAS","ND",6084365,"COSTA HERMOSA",1]
[" JIMENEZ BOVEA ERIKA MARIA   ","erikamariajimenezbovea@gmail.com,",3108181164,"SOLEDAD"," Axiliar Area de la Salud ","ND","AUXILIAR DE ENFERMERIA",2305314,"SALAMANCA",16]
[" JIMENEZ DE LA PEÑA WILFRAN ","wilfran18311@hotmail.com,","300 5768868","BARRANQUILLA"," Medico Especialista  ","MEDICO CIRUJANO","ND",6411891,"CIUDADELA",13]
[" JIMENEZ GARCIA ROSARIO MARIA ","melanyheras@hotmail.com,","300 4442920","BARRANQUILLA"," Axiliar Area de la Salud ","ND","AUXILIAR DE ENFERMERIA",2305314,"SALAMANCA",19]
[" LEAL ARROYUELO EDGAR DE JESUS ","edgarleal_22@hotmail.com,","300 3232464","BARRANQUILLA","Auxiliar Administrativo","ABOGADO","ND",2335679,"COSTA HERMOSA",18]
["LECHUGA ZAMBRANO ESTARLEN DE JESUS","starlen09@hotmail.com,","314 7271933","SABANALARGA"," Tecnico Administrativo ","ND","TECNICO EN GESTION DE SISTEMAS DE MANEJO AMBIENTAL",2638998,"LA CASITA",1]
["MANOTAS ROA ZULMA MARIA","zulmaroa1@hotmail.com,","300 4626924","BARRANQUILLA"," Jefe de Oficina ","ABOGADA","ND",7580046,"COSTA HERMOSA",2]
[" MARTINEZ   BUSTOS SILVIO RAFAEL ","smartinezbustos@hotmail.com,","301 5451196","BARRANQUILLA"," Medico General ","MEDICO CIRUJANO","ND",5125511,"VILLA ESTADIO",13]
[" MARTINEZ CANEPPA MILDRED SUCCETTY ","succetty1511@hotmail.com,","301 5016189","CAMPO DE LA CRUZ"," Medico General ","MEDICO GENERAL","ND",5125511,"13 DE JUNIO",14]
[" MARTINEZ PACHECO  DIANA PATRICIA ","maternosalamanca@hotmail.com,","300 4573599","SOLEDAD"," Medico Especialista  ","MEDICO CIRUJANO","ND",5956368,"SALAMANCA",13]
[" MIRANDA BACA VICTOR HUGO ","mirandavictorhugo@hotmail.com,","301 3360551","SOLEDAD"," Medico Especialista  ","MEDICO Y CIRUJANO,ABOGADO","ND",5956368,"ESPERANZA",2]
["NIEBLES ROBLES MILADIS SOFIA","milasofi23@hotmail.com,","300 4821178","SOLEDAD","Auxiliar Administrativo","ND","SECRETARIA GENERAL",1993342,"COSTA HERMOSA",10]
{"$rows_left_out":27}